Bicyclo[3.1.1]heptane, 6,6-dimethyl-2-methylene-, (1S)-
- Formula: C10H16
- Molecular weight: 136.2340
- IUPAC Standard InChIKey: WTARULDDTDQWMU-UHFFFAOYSA-N
- CAS Registry Number: 18172-67-3
- Chemical structure:
View 3d structure (requires JavaScript / HTML 5) - Species with the same structure:
- Other names: 2(10)-Pinene, (1S,5S)-(-)-; (-)-β-Pinene; (-)-2(10)-Pinene; L-β-Pinene; (1S)-(-)-β-Pinene; laevo-β-Pinene; 6,6-Dimethyl-2-methylenebicyclo[3.1.1]heptane-, (S)-; (-)-beta-Pinene; Bicyclo(3.1.1)heptane, 6,6-dimethyl-2-methylene-, (1S,5S)-; (-)-Pin-2(10)-ene; β-Pinene-(1S)-(-)

Phase change data

Data compiled as indicated in comments:
BS - Robert L. Brown and Stephen E. Stein
AC - William E. Acree, Jr., James S. Chickos
Quantity | Value | Units | Method | Reference | Comment |
---|---|---|---|---|---|
Tboil | 439.2 | K | N/A | Aldrich Chemical Company Inc., 1990 | BS |
Enthalpy of vaporization
ΔvapH (kJ/mol) | Temperature (K) | Method | Reference | Comment |
---|---|---|---|---|
46.1 | 306. | A | Stephenson and Malanowski, 1987 | Based on data from 291. to 441. K.; AC |
44.9 | 308. | N/A | Bukala, Majewski, et al., 1954 | Based on data from 293. to 363. K.; AC |

References

Aldrich Chemical Company Inc., 1990
Aldrich Chemical Company Inc.,
Catalog Handbook of Fine Chemicals, Aldrich Chemical Company, Inc., Milwaukee WI, 1990, 1. [all data]
Stephenson and Malanowski, 1987
Stephenson, Richard M.; Malanowski, Stanislaw,
Handbook of the Thermodynamics of Organic Compounds, 1987, https://doi.org/10.1007/978-94-009-3173-2
. [all data]
Bukala, Majewski, et al., 1954
Bukala, M.; Majewski, J.; Rodzinski, W.,
Przem. Chem., 1954, 10, 6. [all data]