Phenol, o-(α,α-dimethylbenzyl)-
- Formula: C15H16O
- Molecular weight: 212.2869
- IUPAC Standard InChIKey: CJWNFAKWHDOUKL-UHFFFAOYSA-N
- CAS Registry Number: 18168-40-6
- Chemical structure:
View 3d structure (requires JavaScript / HTML 5) - Other names: o-(α,α-Dimethylbenzyl)phenol; 2-(α,α-Dimethylbenzyl)phenol; Dimethylphenol-2-ylphenylmethane

Reaction thermochemistry data

Data compiled by: Hussein Y. Afeefy, Joel F. Liebman, and Stephen E. Stein
Individual Reactions
By formula: C15H16O = C15H16O
Quantity | Value | Units | Method | Reference | Comment |
---|---|---|---|---|---|
ΔrH° | -9.9 ± 2.9 | kJ/mol | Eqk | Roshchupkina, 1986 | liquid phase |

References

Roshchupkina, 1986
Roshchupkina, I.Yu.,
Reaction equilibrium of phenylphenylolpropane and diphenylolpropane,
Termodin. Org. Soedin., 1986, 41-42. [all data]