p-Nitrobenzylidene acetamide
- Formula: C9H8N2O3
- Molecular weight: 192.1714
- IUPAC Standard InChIKey: OAAPPUXSAOJJCV-ZZXKWVIFSA-N
- CAS Registry Number: 18166-67-1
- Chemical structure:
View 3d structure (requires JavaScript / HTML 5) - Permanent link for this species. Use this link for bookmarking this species for future reference.

Condensed phase thermochemistry data

Data compiled by: Hussein Y. Afeefy, Joel F. Liebman, and Stephen E. Stein
Quantity | Value | Units | Method | Reference | Comment |
---|---|---|---|---|---|
ΔfH°solid | -139. | kJ/mol | Ccb | Ciocazanu, Dogaru, et al., 1976 | |
Quantity | Value | Units | Method | Reference | Comment |
ΔcH°solid | -4545.71 | kJ/mol | Ccb | Ciocazanu, Dogaru, et al., 1976 |

References

Ciocazanu, Dogaru, et al., 1976
Ciocazanu, I.; Dogaru, V.; Zavoianu, D.,
Structure and reactivity of amides. Concerning the heats of combustion and formation of some unsaturated α, β amides derived from acetamide,
Rev. Chim. (Bucharest), 1976, 27, 4-6. [all data]