Silane, chloro(1,1-dimethylethyl)dimethyl-
- Formula: C6H15ClSi
- Molecular weight: 150.722
- IUPAC Standard InChIKey: BCNZYOJHNLTNEZ-UHFFFAOYSA-N
- CAS Registry Number: 18162-48-6
- Chemical structure:
View 3d structure (requires JavaScript / HTML 5) - Species with the same structure:
- Other names: Silane, chloro-tert-butyldimethyl-; tert-Butylchlorodimethylsilane; tert-Butyldimethylchlorosilane; tert-Butyldimethylsilyl chloride; Dimethyl-tert-butylchlorosilane; t-Butyldimethylchlorosilane; t-Butyldimethylsilylchloride; Silane, t-butylchlorodimethyl-; CB2790; 2-(Chlorodimethylsilyl)-2-methylpropane; Chloro(1,1-dimethylethyl)dimethylsilane; Chloro-tert-butyldimethylsilane; TBDMS chloride

Phase change data

Data compiled as indicated in comments:
BS - Robert L. Brown and Stephen E. Stein
AC - William E. Acree, Jr., James S. Chickos
Quantity | Value | Units | Method | Reference | Comment |
---|---|---|---|---|---|
Tboil | 397. to 399. | K | N/A | Farchan Laboratories, 1990 | BS |
Tboil | 397. to 399. | K | N/A | PCR Inc., 1990 | BS |
Enthalpy of fusion
ΔfusH (kJ/mol) | Temperature (K) | Method | Reference | Comment |
---|---|---|---|---|
5.6 | 358.1 | DTA,DSC | Bräuninger, Dou, et al., 2010 | AC |

References

Farchan Laboratories, 1990
Farchan Laboratories,
Research Chemicals Catalog, Farchan Laboratories, Gainesville, FL, 1990, 91. [all data]
PCR Inc., 1990
PCR Inc.,
Research Chemicals Catalog 1990-1991, PCR Inc., Gainesville, FL, 1990, 1. [all data]
Bräuninger, Dou, et al., 2010
Bräuninger, Sigmar; Dou, Shi-Qi; Fuess, Hartmut; Schmahl, Wolfgang; Strauß, Roman; Weiss, Alarich,
Orientational disorder in solids composed of the ellipsoid-shaped molecules trichloromethyltrimethylsilane, Cl3CSi(CH3)3, t-Butyltrichlorosilane, (CH3)3CSiCl3, and t-Butyldimethylchlorosilane, (CH3)3CSi(CH3)2Cl,
Berichte der Bunsengesellschaft für physikalische Chemie, 2010, 98, 8, 1096-1099, https://doi.org/10.1002/bbpc.19940980817
. [all data]