2-Methylenetetrahydrofuran
- Formula: C5H8O
- Molecular weight: 84.1164
- IUPAC Standard InChIKey: GCQZRSVHYPEACN-UHFFFAOYSA-N
- CAS Registry Number: 18137-88-7
- Chemical structure:
View 3d structure (requires JavaScript / HTML 5) - Permanent link for this species. Use this link for bookmarking this species for future reference.

Phase change data

Data compiled by: Thermodynamics Research Center, NIST Boulder Laboratories, Chris Muzny director
Quantity | Value | Units | Method | Reference | Comment |
---|---|---|---|---|---|
Tboil | 371.65 | K | N/A | Paul and Tchelitcheff, 1950 | Uncertainty assigned by TRC = 1.5 K |

Reaction thermochemistry data

Data compiled by: Hussein Y. Afeefy, Joel F. Liebman, and Stephen E. Stein
Individual Reactions
By formula: C5H8O = C5H8O
Quantity | Value | Units | Method | Reference | Comment |
---|---|---|---|---|---|
ΔrH° | -4.7 ± 0.3 | kJ/mol | Eqk | Taskinen, 1994 | liquid phase; solvent: Dipentyl ether |

References

Paul and Tchelitcheff, 1950
Paul, R.; Tchelitcheff, S.,
The Methylenyl-2-tetrahydrofuran. Application to the Preparation of beta-Ethylenic Alcohols. Synthesis of Sylvanne,
Bull. Soc. Chim. Fr., 1950, 1950, 520. [all data]
Taskinen, 1994
Taskinen, E.,
Relative thermodynamic stabilities of γ-methylene-γ-butyrolactone and α-angelicalactone,
Tetrahedron, 1994, 50, 1885-1888. [all data]