1,1'-Biphenyl, 2-ethyl-
- Formula: C14H14
- Molecular weight: 182.2610
- IUPAC Standard InChIKey: DLMYHUARHITGIJ-UHFFFAOYSA-N
- CAS Registry Number: 1812-51-7
- Chemical structure:
View 3d structure (requires JavaScript / HTML 5) - Other names: Biphenyl, 2-ethyl-; o-Ethylbiphenyl; 2-Ethylbiphenyl; 1-Ethyl-2-phenylbenzene

Condensed phase thermochemistry data

Data compiled as indicated in comments:
ALS - Hussein Y. Afeefy, Joel F. Liebman, and Stephen E. Stein
DH - Eugene S. Domalski and Elizabeth D. Hearing
Quantity | Value | Units | Method | Reference | Comment |
---|---|---|---|---|---|
ΔcH°liquid | -7585.2 | kJ/mol | Ccb | Wise, Serijan, et al., 1951 | Corresponding ΔfHºliquid = 75.3 kJ/mol (simple calculation by NIST; no Washburn corrections); ALS |
ΔcH°liquid | -7280. | kJ/mol | Ccb | Goodman and Wise, 1950 | Corresponding ΔfHºliquid = -230. kJ/mol (simple calculation by NIST; no Washburn corrections); ALS |
Quantity | Value | Units | Method | Reference | Comment |
S°liquid | 332.69 | J/mol*K | N/A | Chirico, Hossenloop, et al., 1987 | DH |
Constant pressure heat capacity of liquid
Cp,liquid (J/mol*K) | Temperature (K) | Reference | Comment |
---|---|---|---|
302.73 | 298.15 | Chirico, Hossenloop, et al., 1987 | T = 5 to 440 K.; DH |

Phase change data

Data compiled as indicated in comments:
TRC - Thermodynamics Research Center, NIST Boulder Laboratories, Chris Muzny director
BS - Robert L. Brown and Stephen E. Stein
DH - Eugene S. Domalski and Elizabeth D. Hearing
AC - William E. Acree, Jr., James S. Chickos
Quantity | Value | Units | Method | Reference | Comment |
---|---|---|---|---|---|
Tboil | 539.12 | K | N/A | Goodman and Wise, 1951 | Uncertainty assigned by TRC = 0.2 K; TRC |
Tboil | 539.12 | K | N/A | Goodman and Wise, 1950, 2 | Uncertainty assigned by TRC = 0.15 K; TRC |
Quantity | Value | Units | Method | Reference | Comment |
Tfus | 267.02 | K | N/A | Goodman and Wise, 1951 | Uncertainty assigned by TRC = 0.1 K; TRC |
Tfus | 267.02 | K | N/A | Goodman and Wise, 1950, 2 | Uncertainty assigned by TRC = 0.1 K; TRC |
Tfus | 279. | K | N/A | Huber, Renoll, et al., 1946 | Uncertainty assigned by TRC = 2. K; TRC |
Quantity | Value | Units | Method | Reference | Comment |
Ttriple | 267.070 | K | N/A | Chirico, Hossenlopp, et al., 1987 | Uncertainty assigned by TRC = 0.01 K; TRC |
Reduced pressure boiling point
Tboil (K) | Pressure (bar) | Reference | Comment |
---|---|---|---|
401.7 | 0.015 | Weast and Grasselli, 1989 | BS |
Enthalpy of fusion
ΔfusH (kJ/mol) | Temperature (K) | Reference | Comment |
---|---|---|---|
2.0680 | 267.076 | Chirico, Hossenloop, et al., 1987 | DH |
2.07 | 267.1 | Domalski and Hearing, 1996 | AC |
Entropy of fusion
ΔfusS (J/mol*K) | Temperature (K) | Reference | Comment |
---|---|---|---|
7.74 | 267.076 | Chirico, Hossenloop, et al., 1987 | DH |

Gas phase ion energetics data

Data compiled by: Sharon G. Lias, Rhoda D. Levin, and Sherif A. Kafafi
Ionization energy determinations
IE (eV) | Method | Reference | Comment |
---|---|---|---|
8.55 ± 0.02 | PE | Maier and Turner, 1972 | Vertical value |

Reaction thermochemistry data

Data compiled by: Hussein Y. Afeefy, Joel F. Liebman, and Stephen E. Stein

Individual Reactions

1,1'-Biphenyl, 2-ethyl- = 4-Ethylbiphenyl

By formula: C14H14 = C14H14

Quantity Value Units Method Reference Comment
Δr-12.6kJ/molEqkRoshchupkina, Nesterova, et al., 1987liquid phase; T=385.6 K

References

Wise, Serijan, et al., 1951
Wise, C.H.; Serijan, K.T.; Goodman, I.A.,
NACA Technical Report 1003,
NACA Technical Report 1003, 1951, 1-10. [all data]
Goodman and Wise, 1950
Goodman, I.A.; Wise, P.H.,
Dicyclic hydrocarbons. I. 2-Aklylbiphenyls,
J. Am. Chem. Soc., 1950, 72, 3076-3078. [all data]
Chirico, Hossenloop, et al., 1987
Chirico, R.D.; Hossenloop, I.A.; Nguyen, A.; Strube, M.M.; Steele, W.V.,
Thermodynamic studies related to the hydrogenation of phenanthrene,
NIPER Report, 1987, 247, 107p. [all data]
Goodman and Wise, 1951
Goodman, I.A.; Wise, P.H.,
Synthesis & purification of some alkylbiphenyls & alkylbicyclohexyls., Natl. Advis. Comm. Aeronaut., Tech. Note NACA TN 2260, Lewis Flight Propulsion Lab., Cleveland, Ohio, 1951. [all data]
Goodman and Wise, 1950, 2
Goodman, I.A.; Wise, P.H.,
Dicycloic Hydrocarbons I. 2-Alkylbiphenyls,
J. Am. Chem. Soc., 1950, 72, 3076. [all data]
Huber, Renoll, et al., 1946
Huber, W.F.; Renoll, M.; Rossow, A.G.; Mowry, D.T.,
Vinyl Aromatic Compounds II. o-, m-, and p-Vinylbiphenyls,
J. Am. Chem. Soc., 1946, 68, 1109. [all data]
Chirico, Hossenlopp, et al., 1987
Chirico, R.D.; Hossenlopp, I.A.; Nguyen, A.; Steele, W.V.,
Thermochem. and Thermophys. Prop. of Organic Compounds Derived from Fossil Substances. Thermodynamic Studies Related to the Hydrogenation of Anthracene, Natl. Inst. Pet. Energy Res. Rep. NIPER-239, Bartlesvill- e, OK, 1987. [all data]
Weast and Grasselli, 1989
CRC Handbook of Data on Organic Compounds, 2nd Editon, Weast,R.C and Grasselli, J.G., ed(s)., CRC Press, Inc., Boca Raton, FL, 1989, 1. [all data]
Domalski and Hearing, 1996
Domalski, Eugene S.; Hearing, Elizabeth D.,
Heat Capacities and Entropies of Organic Compounds in the Condensed Phase. Volume III,
J. Phys. Chem. Ref. Data, 1996, 25, 1, 1, https://doi.org/10.1063/1.555985
. [all data]