Pyridine, 2-ethyl-5-methyl-
- Formula: C8H11N
- Molecular weight: 121.1796
- IUPAC Standard InChIKey: COHDGTRFTKHYSJ-UHFFFAOYSA-N
- CAS Registry Number: 18113-81-0
- Chemical structure:
View 3d structure (requires JavaScript / HTML 5) - Other names: 2-Ethyl-5-methylpyridine; 5-Methyl-2-ethyl pyridine

Phase change data

Data compiled by: Thermodynamics Research Center, NIST Boulder Laboratories, Chris Muzny director
Quantity | Value | Units | Method | Reference | Comment |
---|---|---|---|---|---|
Tboil | 447.15 | K | N/A | Runge and Hummel, 1951 | Uncertainty assigned by TRC = 2. K |

Kovats' RI, non-polar column, isothermal

Column type | Active phase | Temperature (C) | I | Reference | Comment |
---|---|---|---|---|---|
Packed | Apiezon L | 130. | 1033. | Shatts, Avots, et al., 1977 | He, Chromosorb W AW-DMCS; Column length: 2.4 m |

Van Den Dool and Kratz RI, non-polar column, temperature ramp

Column type | Active phase | I | Reference | Comment |
---|---|---|---|---|
Capillary | DB-5 | 1023. | Venskutonis, Vasiliauskaite, et al., 2002 | 30. m/0.32 mm/0.25 μm, He, 40. C @ 4. min, 5. K/min; Tend: 260. C |

Van Den Dool and Kratz RI, polar column, custom temperature program

Column type | Active phase | I | Reference | Comment |
---|---|---|---|---|
Capillary | Carbowax 20M | 1385. | Baltes and Bochmann, 1987 | Column length: 50. m; Column diameter: 0.3 mm; Program: not specified |

Normal alkane RI, polar column, temperature ramp

Column type | Active phase | I | Reference | Comment |
---|---|---|---|---|
Capillary | Carbowax 20M | 1390. | Seifert and King, 1982 | He, 50. C @ 10. min, 1. K/min, 170. C @ 60. min; Column length: 150. m; Column diameter: 0.64 mm |

Normal alkane RI, polar column, custom temperature program

Column type | Active phase | I | Reference | Comment |
---|---|---|---|---|
Capillary | Carbowax | 1384. | Baltes and Bochmann, 1987, 2 | Program: not specified |
Capillary | Carbowax | 1385. | Baltes and Bochmann, 1987, 2 | Program: not specified |
Capillary | Carbowax | 1386. | Baltes and Bochmann, 1987, 2 | Program: not specified |
Capillary | Carbowax | 1386. | Baltes and Bochmann, 1987, 2 | Program: not specified |
Capillary | Carbowax | 1388. | Baltes and Bochmann, 1987, 2 | Program: not specified |

References

Runge and Hummel, 1951
Runge, F.; Hummel, H.,
Catalytic conversion of actylene with ammonia,
Chem. Tech. (Leipzig), 1951, 3, 163. [all data]
Shatts, Avots, et al., 1977
Shatts, V.D.; Avots, A.A.; Belikov, V.A.,
Retention indices of alkylpyridines,
Zh. Anal. Khim., 1977, 32, 4, 631-638. [all data]
Venskutonis, Vasiliauskaite, et al., 2002
Venskutonis, R.P.; Vasiliauskaite, R.; Galdikas, A.; Setkus, A.,
Use of GC-headspace and electronic nose for the detection of volatile compounds from glucose-glycine Maillard reaction,
Food Control, 2002, 13, 1, 13-21, https://doi.org/10.1016/S0956-7135(01)00045-7
. [all data]
Baltes and Bochmann, 1987
Baltes, W.; Bochmann, G.,
Model reactions on roast aroma formation. 1. Reaction of serine and threonine with sucrose under the conditions of coffee roasting and identification of new coffee aroma compounds,
J. Agric. Food Chem., 1987, 35, 3, 340-346, https://doi.org/10.1021/jf00075a015
. [all data]
Seifert and King, 1982
Seifert, R.M.; King, A.D., Jr.,
Identification of some volatile constituents of Aspergillus clavatus,
J. Agric. Food Chem., 1982, 30, 4, 786-790, https://doi.org/10.1021/jf00112a044
. [all data]
Baltes and Bochmann, 1987, 2
Baltes, W.; Bochmann, G.,
Model reactions on roast aroma formations, V. Mass spectrometric identification of pyrifines, oxazoles, and carbocyclic compounds from the reaction of serine and threonine with sucrose under the conditions of coffee roasting,
Z. Lebensm. Unters. Forsch., 1987, 185, 1, 5-9, https://doi.org/10.1007/BF01083331
. [all data]