Phenol, 2,5-dichloro-4-methoxy-
- Formula: C7H6Cl2O2
- Molecular weight: 193.027
- IUPAC Standard InChIKey: JXKFAPUUGWQXHX-UHFFFAOYSA-N
- CAS Registry Number: 18113-14-9
- Chemical structure:
View 3d structure (requires JavaScript / HTML 5) - Other names: 2,5-Dichloro-4-methoxyphenol; Hydroxy chloroneb

Phase change data

Data compiled by: Thermodynamics Research Center, NIST Boulder Laboratories, Chris Muzny director
Quantity | Value | Units | Method | Reference | Comment |
---|---|---|---|---|---|
Tfus | 362. | K | N/A | Plato, 1972 | Uncertainty assigned by TRC = 0.2 K |

References

Plato, 1972
Plato, C.,
DSC as a general method for determining purity and heat of fusion of high-purity organic chemicals,
Anal. Chem., 1972, 44, 1531. [all data]