Phenol, 2-chloro-4-methoxy-
- Formula: C7H7ClO2
- Molecular weight: 158.582
- IUPAC Standard InChIKey: GNVRRKLFFYSLGT-UHFFFAOYSA-N
- CAS Registry Number: 18113-03-6
- Chemical structure:
View 3d structure (requires JavaScript / HTML 5) - Other names: 2-Chloro-4-methoxyphenol

Van Den Dool and Kratz RI, non-polar column, custom temperature program

Column type | Active phase | I | Reference | Comment |
---|---|---|---|---|
Capillary | VF-5MS | 1260.1 | Tret'yakov, 2008 | 30. m/0.25 mm/0.25 μm, He; Program: Multi-step temperature program; T(initial)=60C; T(final)=270C |

References

Tret'yakov, 2008
Tret'yakov, K.V.,
Retention Data. NIST Mass Spectrometry Data Center., NIST Mass Spectrometry Data Center, 2008. [all data]