Phosphonic acid, dipropyl ester
- Formula: C6H15O3P
- Molecular weight: 166.1553
- IUPAC Standard InChIKey: PVBGKAMVCZUNFQ-UHFFFAOYSA-N
- CAS Registry Number: 1809-21-8
- Chemical structure:
View 3d structure (requires JavaScript / HTML 5) - Other names: dipropyl phosphonate

Phase change data

Data compiled by: William E. Acree, Jr., James S. Chickos
Enthalpy of vaporization
ΔvapH (kJ/mol) | Temperature (K) | Method | Reference | Comment |
---|---|---|---|---|
38.1 | 333. | A | Stephenson and Malanowski, 1987 | Based on data from 318. to 467. K. See also Dykyj, 1972. |

References

Stephenson and Malanowski, 1987
Stephenson, Richard M.; Malanowski, Stanislaw,
Handbook of the Thermodynamics of Organic Compounds, 1987, https://doi.org/10.1007/978-94-009-3173-2
. [all data]
Dykyj, 1972
Dykyj, J.,
Petrochemia, 1972, 12, 1, 13. [all data]