CH6OSi
- Formula: CH6OSi
- Molecular weight: 62.1432
- CAS Registry Number: 18089-54-8

Reaction thermochemistry data

Data compiled by: John E. Bartmess
Individual Reactions
CH5OSi- + = CH6OSi
By formula: CH5OSi- + H+ = CH6OSi
Quantity | Value | Units | Method | Reference | Comment |
---|---|---|---|---|---|
ΔrH° | 1502. ± 17. | kJ/mol | G+TS | Damrauer, Simon, et al., 1991 | gas phase; between pyrrole, CF3CH2OH |
Quantity | Value | Units | Method | Reference | Comment |
ΔrG° | 1475. ± 17. | kJ/mol | IMRB | Damrauer, Simon, et al., 1991 | gas phase; between pyrrole, CF3CH2OH |

Gas phase ion energetics data

Data compiled by: John E. Bartmess
De-protonation reactions
CH5OSi- + = CH6OSi
By formula: CH5OSi- + H+ = CH6OSi
Quantity | Value | Units | Method | Reference | Comment |
---|---|---|---|---|---|
ΔrH° | 1502. ± 17. | kJ/mol | G+TS | Damrauer, Simon, et al., 1991 | gas phase; between pyrrole, CF3CH2OH |
Quantity | Value | Units | Method | Reference | Comment |
ΔrG° | 1475. ± 17. | kJ/mol | IMRB | Damrauer, Simon, et al., 1991 | gas phase; between pyrrole, CF3CH2OH |

References

Damrauer, Simon, et al., 1991
Damrauer, R.; Simon, R.; Krempp, M.,
Effect of Substituents on the Gas-Phase Acidity of Silanols,
J. Am. Chem. Soc., 1991, 113, 12, 4431, https://doi.org/10.1021/ja00012a009
. [all data]