1,4-Bis(5-phenyloxazol-2-yl)benzene
- Formula: C24H16N2O2
- Molecular weight: 364.3960
- IUPAC Standard InChIKey: MASVCBBIUQRUKL-UHFFFAOYSA-N
- CAS Registry Number: 1806-34-4
- Chemical structure:
View 3d structure (requires JavaScript / HTML 5) - Other names: POPOP; Oxazole, 2,2'-(1,4-phenylene)bis[5-phenyl-; p-Bis(5-phenyloxazol-2-yl)benzene; Oxazole, 2,2'-p-phenylenebis(5-phenyl-; 1,4-Bis(2-(5-phenyloxazolyl))benzene; 2,2'-p-Phenylenebis(5-phenyloxazole); 2,2'-(1,4-Phenylene)bis(5-phenyl)oxazole

Phase change data

Data compiled by: William E. Acree, Jr., James S. Chickos
Enthalpy of sublimation
ΔsubH (kcal/mol) | Temperature (K) | Method | Reference | Comment |
---|---|---|---|---|
33.5 | 480. | Optical | Schmidt and Penzkofer, 1989 | |
22.6 | 615. | A | Stephenson and Malanowski, 1987 | Based on data from 600. to 680. K. See also Steyer and Schäfer, 1975. |

Kovats' RI, non-polar column, custom temperature program

View large format table.

Column type Active phase I Reference Comment
PackedSE-303525.Ramsey, Lee, et al., 1980He, Chromosorb G HP (80-100 mesh); Column length: 1.5 m; Program: not specified

Normal alkane RI, non-polar column, custom temperature program

View large format table.

Column type Active phase I Reference Comment
OtherMethyl Silicone3525.Ardrey and Moffat, 1981Program: not specified

References

Schmidt and Penzkofer, 1989
Schmidt, J.; Penzkofer, A.,
Absorption cross sections, saturated vapor pressures, sublimation energies, and evaporation energies of some organic laser dye vapors,
J. Chem. Phys., 1989, 91, 3, 1403, https://doi.org/10.1063/1.457152
. [all data]
Stephenson and Malanowski, 1987
Stephenson, Richard M.; Malanowski, Stanislaw,
Handbook of the Thermodynamics of Organic Compounds, 1987, https://doi.org/10.1007/978-94-009-3173-2
. [all data]
Steyer and Schäfer, 1975
Steyer, Bernd; Schäfer, Fritz P.,
Stimulated and spontaneous emission from laser dyes in the vapor phase,
Appl. Phys., 1975, 7, 2, 113-122, https://doi.org/10.1007/BF00884220
. [all data]