[1,1'-Biphenyl]-2,2'-diol
- Formula: C12H10O2
- Molecular weight: 186.2066
- IUPAC Standard InChIKey: IMHDGJOMLMDPJN-UHFFFAOYSA-N
- CAS Registry Number: 1806-29-7
- Chemical structure:
View 3d structure (requires JavaScript / HTML 5) - Species with the same structure:
- Other names: 2,2'-Biphenyldiol; o-Dihydroxydiphenyl; o,o'-Biphenol; o,o'-Dihydroxybiphenyl; o,o'-Diphenol; 2,2'-Biphenol; 2,2'-Dihydroxybiphenyl; 2,2'-Dihydroxydiphenyl; Biphenyl-2,2'-diol; 2,2'-Dihydroxy-1,1'-biphenyl; Biphenyl, 2,2'-dihydroxy; 2,2'-Bisphenol; NSC 37068; O,O'-biphenylol

Phase change data

Data compiled as indicated in comments:
BS - Robert L. Brown and Stephen E. Stein
AC - William E. Acree, Jr., James S. Chickos
Quantity | Value | Units | Method | Reference | Comment |
---|---|---|---|---|---|
Tboil | 588.2 | K | N/A | Weast and Grasselli, 1989 | BS |
Quantity | Value | Units | Method | Reference | Comment |
ΔsubH° | 114.4 ± 1.2 | kJ/mol | GS | Verevkin, 1998 | Based on data from 334. to 363. K.; AC |
Enthalpy of vaporization
ΔvapH (kJ/mol) | Temperature (K) | Method | Reference | Comment |
---|---|---|---|---|
61.7 | 459. | A | Stephenson and Malanowski, 1987 | Based on data from 444. to 598. K.; AC |
Enthalpy of sublimation
ΔsubH (kJ/mol) | Temperature (K) | Method | Reference | Comment |
---|---|---|---|---|
111.4 ± 1.2 | 349. | GS | Verevkin, 1998 | Based on data from 334. to 363. K.; AC |
Enthalpy of fusion
ΔfusH (kJ/mol) | Temperature (K) | Method | Reference | Comment |
---|---|---|---|---|
25.36 | 386.7 | DSC | Verevkin, 1998 | AC |

Kovats' RI, non-polar column, isothermal

Column type | Active phase | Temperature (C) | I | Reference | Comment |
---|---|---|---|---|---|
Packed | OV-101 | 197. | 1655. | Dufek, Pacáková, et al., 1981 | N2, Chromaton N Super (0,125-0,16 mm); Column length: 2. m |

Normal alkane RI, non-polar column, temperature ramp

Column type | Active phase | I | Reference | Comment |
---|---|---|---|---|
Capillary | DB-5 MS | 1667. | Ulrich, Schuurmann, et al., 2013 | 30. m/0.25 mm/0.25 μm, Helium, 50. C @ 4. min, 6. K/min, 300. C @ 20. min |
Capillary | HP-5 | 1662. | Zenkevich, Moeder, et al., 2004 | 30. m/0.25 mm/0.25 μm, Helium, 50. C @ 3. min, 3. K/min, 280. C @ 20. min |

References

Weast and Grasselli, 1989
CRC Handbook of Data on Organic Compounds, 2nd Editon, Weast,R.C and Grasselli, J.G., ed(s)., CRC Press, Inc., Boca Raton, FL, 1989, 1. [all data]
Verevkin, 1998
Verevkin, Sergey P.,
Thermochemistry of phenols: experimental standard molar enthalpies of formation of 2-phenylphenol, 4-phenylphenol, 2,6-diphenylphenol, and 2,2´- and 4,4´-dihydroxybiphenyl,
The Journal of Chemical Thermodynamics, 1998, 30, 3, 389-396, https://doi.org/10.1006/jcht.1997.0316
. [all data]
Stephenson and Malanowski, 1987
Stephenson, Richard M.; Malanowski, Stanislaw,
Handbook of the Thermodynamics of Organic Compounds, 1987, https://doi.org/10.1007/978-94-009-3173-2
. [all data]
Dufek, Pacáková, et al., 1981
Dufek, P.; Pacáková, V.; Zivný, K.,
Gas chromatographic behaviour of mono- and dihydroxybiphenyls on various silicone phases,
J. Chromatogr., 1981, 211, 1, 150-154, https://doi.org/10.1016/S0021-9673(00)81184-X
. [all data]
Ulrich, Schuurmann, et al., 2013
Ulrich, N.; Schuurmann, G.; Brack, W.,
Prediction of gas chromatographic retention indices as classifier in non-target analysis of environmental samples,
J. Chromatogr. A, 2013, 1285, 139-147, https://doi.org/10.1016/j.chroma.2013.02.037
. [all data]
Zenkevich, Moeder, et al., 2004
Zenkevich, I.G.; Moeder, M.; Koeller, G.; Schrader, S.,
Using new structurally related additive schemes in the precalculation of gas chromatographic retention indices of polychlorinated hydroxybiphenyls on HP-5 stationary phase,
J. Chromatogr. A, 2004, 1025, 2, 227-236, https://doi.org/10.1016/j.chroma.2003.10.106
. [all data]