Spiro[5.5]undecane
- Formula: C11H20
- Molecular weight: 152.2765
- IUPAC Standard InChIKey: NECLQTPQJZSWOE-UHFFFAOYSA-N
- CAS Registry Number: 180-43-8
- Chemical structure:
View 3d structure (requires JavaScript / HTML 5) - Other names: Spiro(5,5)undecane

Gas phase thermochemistry data

Data compiled as indicated in comments:
ALS - Hussein Y. Afeefy, Joel F. Liebman, and Stephen E. Stein
DRB - Donald R. Burgess, Jr.
Quantity | Value | Units | Method | Reference | Comment |
---|---|---|---|---|---|
ΔfH°gas | -188.3 ± 3.1 | kJ/mol | Ccb | Subach and Zwolinski, 1975 | ALS |
ΔfH°gas | -191.8 | kJ/mol | N/A | Kozin, Mirzaeva, et al., 1964 | Value computed using ΔfHliquid° value of -248.0±2.0 kj/mol from Kozin, Mirzaeva, et al., 1964 and ΔvapH° value of 56.2 kj/mol from Subach and Zwolinski, 1975.; DRB |

Condensed phase thermochemistry data

Data compiled by: Hussein Y. Afeefy, Joel F. Liebman, and Stephen E. Stein
Quantity | Value | Units | Method | Reference | Comment |
---|---|---|---|---|---|
ΔfH°liquid | -244.5 ± 3.0 | kJ/mol | Ccb | Subach and Zwolinski, 1975 | |
ΔfH°liquid | -248. ± 2. | kJ/mol | Ccb | Kozin, Mirzaeva, et al., 1964 | |
Quantity | Value | Units | Method | Reference | Comment |
ΔcH°liquid | -6942.4 ± 2.8 | kJ/mol | Ccb | Subach and Zwolinski, 1975 | Corresponding ΔfHºliquid = -244.5 kJ/mol (simple calculation by NIST; no Washburn corrections) |
ΔcH°liquid | -6939. ± 2. | kJ/mol | Ccb | Kozin, Mirzaeva, et al., 1964 | Corresponding ΔfHºliquid = -248. kJ/mol (simple calculation by NIST; no Washburn corrections) |

Phase change data

Data compiled as indicated in comments:
TRC - Thermodynamics Research Center, NIST Boulder Laboratories, Chris Muzny director
ALS - Hussein Y. Afeefy, Joel F. Liebman, and Stephen E. Stein
DRB - Donald R. Burgess, Jr.
AC - William E. Acree, Jr., James S. Chickos
Quantity | Value | Units | Method | Reference | Comment |
---|---|---|---|---|---|
Tfus | 248.65 | K | N/A | Anonymous, 1968 | Uncertainty assigned by TRC = 0.5 K; TRC |
Tfus | 248.7 | K | N/A | Hogenboon, Webb, et al., 1967 | Uncertainty assigned by TRC = 0.5 K; TRC |
Tfus | 248.7 | K | N/A | Naro, 1960 | Uncertainty assigned by TRC = 0.6 K; TRC |
Quantity | Value | Units | Method | Reference | Comment |
ΔvapH° | 56.1 ± 0.1 | kJ/mol | V | Subach and Zwolinski, 1975 | ALS |
ΔvapH° | 56.2 | kJ/mol | N/A | Subach and Zwolinski, 1975 | DRB |
ΔvapH° | 56.1 | kJ/mol | C | Subach and Zwolinski, 1975 | AC |
Quantity | Value | Units | Method | Reference | Comment |
ΔsubH° | 63.6 ± 0.8 | kJ/mol | C | Parker, Steele, et al., 1975 | See also Pedley and Rylance, 1977.; AC |

References

Subach and Zwolinski, 1975
Subach, D.J.; Zwolinski, B.J.,
Enthalpies of combustion, formation, and vaporization of spiro[4,5]decane, spiro[5,5]undecane, and 7-n-Hexadecylspiro[4,5]decane,
J. Chem. Eng. Data, 1975, 20, 232-235. [all data]
Kozin, Mirzaeva, et al., 1964
Kozin, M.P.; Mirzaeva, A.K.; Sosina, I.E.; Elagina, N.V.; Skuratov, S.M.,
The heats of formation of spiro hydrocarbons,
Dokl. Phys. Chem. (Engl. Transl.), 1964, 155, 375-377. [all data]
Anonymous, 1968
Anonymous, R.,
Properties of hydrocarbon of high molecular weight, Am. Pet. Inst. Res. Proj. 42, Penn. State Univ., 1968. [all data]
Hogenboon, Webb, et al., 1967
Hogenboon, D.L.; Webb, W.; Dixon, J.A.,
J. Chem. Phys., 1967, 46, 2586. [all data]
Naro, 1960
Naro, P.A.,
, PhD Thesis, 1960. [all data]
Parker, Steele, et al., 1975
Parker, W.; Steele, W.V.; Stirling, W.; Watt, I.,
A high-precision aneroid static-bomb combustion calorimeter for samples of about 20 mg. The standard enthalpy of formation of bicyclo[3.3.3]undecane,
J. Chem. Thermodyn., 1975, 7, 795-802. [all data]
Pedley and Rylance, 1977
Pedley, J.B.; Rylance, J.,
, Computer Analysed Thermochemical Data: Organic and Organometallic Compounds, University of Sussex, Brighton, 1977. [all data]