1-Cyclohexene-1-carboxaldehyde, 4-(1-methylethenyl)-, (S)-
- Formula: C10H14O
- Molecular weight: 150.2176
- IUPAC Standard InChIKey: RUMOYJJNUMEFDD-UHFFFAOYSA-N
- CAS Registry Number: 18031-40-8
- Chemical structure:
View 3d structure (requires JavaScript / HTML 5) - Species with the same structure:
- Stereoisomers:
- Other names: L-Perillaldehyde; 1-Cyclohexene-1-carboxaldehyde, 4-isopropenyl-, (S)-(-)-; (-)-Perillaldehyde; (4S)-p-Mentha-1,8-dien-7-al; (S)-(-)-Perillaldehyde; 4-Isopropenyl-1-cyclohexene-1-carbaldehyde, (S)-; (S)-(-)-Perillic aldehyde; 1-Cyclohexene-1-carboxaldehyde, 4-(1-methylethenyl)-, (4S)-; (-)-Perilla aldehyde; 1-perillaldehyde

Phase change data

Data compiled by: Robert L. Brown and Stephen E. Stein
Reduced pressure boiling point
Tboil (K) | Pressure (bar) | Reference |
---|---|---|
377.7 | 0.013 | Aldrich Chemical Company Inc., 1990 |

References

Aldrich Chemical Company Inc., 1990
Aldrich Chemical Company Inc.,
Catalog Handbook of Fine Chemicals, Aldrich Chemical Company, Inc., Milwaukee WI, 1990, 1. [all data]