Carbazole, 1,4-dimethyl-
- Formula: C14H13N
- Molecular weight: 195.2597
- IUPAC Standard InChIKey: APYQRKDHRDGCBK-UHFFFAOYSA-N
- CAS Registry Number: 18028-55-2
- Chemical structure:
View 3d structure (requires JavaScript / HTML 5) - Permanent link for this species. Use this link for bookmarking this species for future reference.

Normal alkane RI, non-polar column, temperature ramp

Column type | Active phase | I | Reference | Comment |
---|---|---|---|---|
Capillary | PONA | 1912. | Yang, Wang, et al., 2004 | 50. m/0.20 mm/0.50 μm, 1.5 K/min, 270. C @ 10. min; Tstart: 120. C |

Lee's RI, non-polar column, temperature ramp

Column type | Active phase | I | Reference | Comment |
---|---|---|---|---|
Capillary | SE-52 | 343.16 | Vassilaros, Kong, et al., 1982 | 20. m/0.30 mm/0.25 μm, H2, 40. C @ 2. min, 4. K/min; Tend: 265. C |

References

Yang, Wang, et al., 2004
Yang, Y.; Wang, Z.; Yang, H.; Lu, W.,
Study on distribution of nitrogen compounds in catalytic diesel oil by gas chromatography - atomic emission detector,
Chin. J. Chromatogr., 2004, 22, 5, 499-504. [all data]
Vassilaros, Kong, et al., 1982
Vassilaros, D.L.; Kong, R.C.; Later, D.W.; Lee, M.L.,
Linear retention index system for polycyclic aromatic compounds. Critical evaluation and additional indices,
J. Chromatogr., 1982, 252, 1-20, https://doi.org/10.1016/S0021-9673(01)88394-1
. [all data]