6,6,8,8-Tetramethyl-2,5,7,9,12-pentaoxa-6,8-disilatridecane
- Formula: C10H26O5Si2
- Molecular weight: 282.4814
- IUPAC Standard InChIKey: NTMJKYJLZQVEPF-UHFFFAOYSA-N
- CAS Registry Number: 18001-62-2
- Chemical structure:
View 3d structure (requires JavaScript / HTML 5) - Other names: Silane, dimethyl(dimethyl(2-methoxyethoxy)silyloxy)(2-methoxyethoxy)-

Van Den Dool and Kratz RI, non-polar column, custom temperature program

Column type | Active phase | I | Reference | Comment |
---|---|---|---|---|
Capillary | VF-5MS | 1324. | Tretyakov, 2011 | 30. m/0.25 mm/0.25 μm, He; Program: Multi-step temperature program; T(initial)=60C; T(final)=270C |
Capillary | 5 % Phenyl methyl siloxane | 1314. | Zaikin, 2008 | Column length: 30. m; Column diameter: 0.19 mm; Program: 20C => 5C/min => 120C => 10C/min => 280C |

References

Tretyakov, 2011
Tretyakov, K.V.,
Retention Data. NIST Mass Spectrometry Data Center., NIST Mass Spectrometry Data Center, 2011. [all data]
Zaikin, 2008
Zaikin, V.G.,
Personal Communication: Retention indices measured during the period 2007 to 2008, 2008. [all data]