meso-2,3-butanediol diacetate
- Formula: C8H14O4
- Molecular weight: 174.1944
- IUPAC Standard InChIKey: VVSAAKSQXNXBML-OLQVQODUSA-N
- CAS Registry Number: 17998-02-6
- Chemical structure:
View 3d structure (requires JavaScript / HTML 5) - Species with the same structure:
- Stereoisomers:

Phase change data

Data compiled by: Thermodynamics Research Center, NIST Boulder Laboratories, Chris Muzny director
Quantity | Value | Units | Method | Reference | Comment |
---|---|---|---|---|---|
Tboil | 464.7 | K | N/A | Othmer, Shlechter, et al., 1945 | Uncertainty assigned by TRC = 4. K |

References

Othmer, Shlechter, et al., 1945
Othmer, D.F.; Shlechter, N.; Koszalka, W.A.,
Composition of vapours from boiling binary solutions - systems used in butadiene manufacture from butylene glycol.,
Ind. Eng. Chem., 1945, 37, 895. [all data]