Silane, dimethyldihexyloxy-
- Formula: C14H32O2Si
- Molecular weight: 260.4882
- IUPAC Standard InChIKey: AIBXROJFINODCQ-UHFFFAOYSA-N
- CAS Registry Number: 17957-66-3
- Chemical structure:
View 3d structure (requires JavaScript / HTML 5) - Other names: bis(Hexyloxy)(dimethyl)silane; Dihexyloxydimethylsilane

Van Den Dool and Kratz RI, non-polar column, custom temperature program

Column type | Active phase | I | Reference | Comment |
---|---|---|---|---|
Capillary | 5 % Phenyl methyl siloxane | 1487. | Zaikin, 2008 | Column length: 30. m; Column diameter: 0.19 mm; Program: 20C => 5C/min => 120C => 10C/min => 280C |
Capillary | VF-5MS | 1458.7 | Tret'yakov, 2007 | 30. m/0.25 mm/0.25 μm, He; Program: Multi-step temperature program; T(initial)=60C; T(final)=270C |
Capillary | VF-5MS | 1459.6 | Tret'yakov, 2007 | 30. m/0.25 mm/0.25 μm, He; Program: Multi-step temperature program; T(initial)=60C; T(final)=270C |

References

Zaikin, 2008
Zaikin, V.G.,
Personal Communication: Retention indices measured during the period 2007 to 2008, 2008. [all data]
Tret'yakov, 2007
Tret'yakov, K.V.,
Retention Data. NIST Mass Spectrometry Data Center., NIST Mass Spectrometry Data Center, 2007. [all data]