Cyclopentane, decyl-
- Formula: C15H30
- Molecular weight: 210.3987
- IUPAC Standard InChIKey: WOUVLFFZQCUYOL-UHFFFAOYSA-N
- CAS Registry Number: 1795-21-7
- Chemical structure:
View 3d structure (requires JavaScript / HTML 5) - Other names: Decane, 1-cyclopentyl-; Decylcyclopentane; n-Decylcyclopentane; 1-Cyclopentyldecane

Gas phase thermochemistry data

Data compiled by: Glushko Thermocenter, Russian Academy of Sciences, Moscow
Quantity | Value | Units | Method | Reference | Comment |
---|---|---|---|---|---|
S°gas | 688.06 | J/mol*K | N/A | Messerly J.F., 1965 |

Condensed phase thermochemistry data

Data compiled as indicated in comments:
ALS - Hussein Y. Afeefy, Joel F. Liebman, and Stephen E. Stein
DH - Eugene S. Domalski and Elizabeth D. Hearing
Quantity | Value | Units | Method | Reference | Comment |
---|---|---|---|---|---|
ΔfH°liquid | -368.2 ± 2.1 | kJ/mol | Ccb | Fraser and Prosen, 1955 | ALS |
Quantity | Value | Units | Method | Reference | Comment |
ΔcH°liquid | -9824.1 ± 2.7 | kJ/mol | Ccb | Loeffler and Rossini, 1960 | Corresponding ΔfHºliquid = -366.02 kJ/mol (simple calculation by NIST; no Washburn corrections); ALS |
ΔcH°liquid | -9822.1 ± 1.9 | kJ/mol | Ccb | Fraser and Prosen, 1955 | Corresponding ΔfHºliquid = -368.0 kJ/mol (simple calculation by NIST; no Washburn corrections); ALS |
Quantity | Value | Units | Method | Reference | Comment |
S°liquid | 538.52 | J/mol*K | N/A | Messerly, Todd, et al., 1965 | DH |
Quantity | Value | Units | Method | Reference | Comment |
ΔcH°solid | -9825.7 | kJ/mol | Ccb | Ruzieka and Schlapfer, 1933 | Heat of combustion corrected for pressure; Corresponding ΔfHºsolid = -364. kJ/mol (simple calculation by NIST; no Washburn corrections); ALS |
Constant pressure heat capacity of liquid
Cp,liquid (J/mol*K) | Temperature (K) | Reference | Comment |
---|---|---|---|
426.52 | 298.15 | Messerly, Todd, et al., 1965 | T = 12 to 370 K.; DH |

Phase change data

Data compiled as indicated in comments:
BS - Robert L. Brown and Stephen E. Stein
TRC - Thermodynamics Research Center, NIST Boulder Laboratories, Chris Muzny director
AC - William E. Acree, Jr., James S. Chickos
DH - Eugene S. Domalski and Elizabeth D. Hearing
Quantity | Value | Units | Method | Reference | Comment |
---|---|---|---|---|---|
Tboil | 552.2 | K | N/A | Weast and Grasselli, 1989 | BS |
Tboil | 552.3 | K | N/A | Boord, Greenlee, et al., 1950 | Uncertainty assigned by TRC = 0.3 K; TRC |
Tboil | 551.4 | K | N/A | Boord, Greenlee, et al., 1949 | Uncertainty assigned by TRC = 0.4 K; TRC |
Quantity | Value | Units | Method | Reference | Comment |
Tfus | 250.8 ± 0.9 | K | AVG | N/A | Average of 7 values; Individual data points |
Quantity | Value | Units | Method | Reference | Comment |
Ttriple | 251.02 | K | N/A | Messerly, Todd, et al., 1965, 2 | Uncertainty assigned by TRC = 0.01 K; TRC |
Quantity | Value | Units | Method | Reference | Comment |
ΔvapH° | 75.7 | kJ/mol | N/A | Reid, 1972 | AC |
Enthalpy of vaporization
ΔvapH (kJ/mol) | Temperature (K) | Method | Reference | Comment |
---|---|---|---|---|
71.1 | 373. | A | Stephenson and Malanowski, 1987 | Based on data from 358. to 411. K.; AC |
59.7 | 468. | A,MM | Stephenson and Malanowski, 1987 | Based on data from 453. to 553. K. See also Camin, Forziati, et al., 1954.; AC |
Antoine Equation Parameters
log10(P) = A − (B / (T + C))
P = vapor pressure (bar)
T = temperature (K)
View plot Requires a JavaScript / HTML 5 canvas capable browser.
Temperature (K) | A | B | C | Reference | Comment |
---|---|---|---|---|---|
455.02 to 552.43 | 4.11335 | 1813.495 | -111.037 | Camin, Forziati, et al., 1954 | Coefficents calculated by NIST from author's data. |
Enthalpy of fusion
ΔfusH (kJ/mol) | Temperature (K) | Reference | Comment |
---|---|---|---|
33.125 | 251.02 | Messerly, Todd, et al., 1965 | DH |
33.14 | 251. | Domalski and Hearing, 1996 | AC |
Entropy of fusion
ΔfusS (J/mol*K) | Temperature (K) | Reference | Comment |
---|---|---|---|
132.0 | 251.02 | Messerly, Todd, et al., 1965 | DH |

References

Messerly J.F., 1965
Messerly J.F.,
Low-temperature thermodynamic properties of n-propyl-, n-butyl-, and n-decyl-substituted cyclopentanes,
J. Phys. Chem., 1965, 69, 353-359. [all data]
Fraser and Prosen, 1955
Fraser, F.M.; Prosen, E.J.,
Heats of combustion of liquid n-hexadecane, 1-hexadecene, n-decylbenzene, n-decylcyclohexane, n-decylcyclopentane, and the variation of heat of combustion with chain length,
J. Res. NBS, 1955, 55, 329-333. [all data]
Loeffler and Rossini, 1960
Loeffler, S.M.C.; Rossini, F.D.,
Heats of combustion and formation of the higher normal alkyl cyclopentanes, cyclohexanes, benzenes and 1-alkenes in the liquid state at 25°,
J. Phys. Chem., 1960, 64, 1530-1533. [all data]
Messerly, Todd, et al., 1965
Messerly, J.F.; Todd, S.S.; Finke, H.L.,
Low-temperature thermodynamic properties of n-propyl-, n-butyl-, and n-decyl-substituted cyclopentanes,
J. Phys. Chem., 1965, 69, 353-359. [all data]
Ruzieka and Schlapfer, 1933
Ruzieka, L.; Schlapfer, P.,
Zur kenntnis des kohlenstoffringes XXII. Uber die verbrennungswarme bei hochgliedrigen ringverbindungen,
Helv. Chim. Acta, 1933, 16, 162-169. [all data]
Weast and Grasselli, 1989
CRC Handbook of Data on Organic Compounds, 2nd Editon, Weast,R.C and Grasselli, J.G., ed(s)., CRC Press, Inc., Boca Raton, FL, 1989, 1. [all data]
Boord, Greenlee, et al., 1950
Boord, C.E.; Greenlee, K.W.; Derfer, J.M.,
The Synthesis, Purification and Prop. of Hydrocarbons of Low Mol. Wt., Am. Pet. Inst. Res. Proj. 45, Twelfth Annu. Rep., Ohio State Univ., 1950. [all data]
Boord, Greenlee, et al., 1949
Boord, C.E.; Greenlee, K.W.; Perilstein, W.L.; Derfer, J.M.,
The Synthesis, Purification and Prop. of Hydrocarbons of Low Mol. Wt., Am. Pet. Inst. Res. Proj. 45, Eleventh Annu. Rep., Ohio State Univ., 1949. [all data]
Messerly, Todd, et al., 1965, 2
Messerly, J.F.; Todd, S.S.; Finke, H.L.,
Low-Temperature Thermodynamic Properties of n-Propyl, n-Butyl and n-Decyl-Substituted Cyclopentanes,
J. Phys. Chem., 1965, 69, 353-9. [all data]
Reid, 1972
Reid, Robert C.,
Handbook on vapor pressure and heats of vaporization of hydrocarbons and related compounds, R. C. Wilhort and B. J. Zwolinski, Texas A Research Foundation. College Station, Texas(1971). 329 pages.$10.00,
AIChE J., 1972, 18, 6, 1278-1278, https://doi.org/10.1002/aic.690180637
. [all data]
Stephenson and Malanowski, 1987
Stephenson, Richard M.; Malanowski, Stanislaw,
Handbook of the Thermodynamics of Organic Compounds, 1987, https://doi.org/10.1007/978-94-009-3173-2
. [all data]
Camin, Forziati, et al., 1954
Camin, David L.; Forziati, Alphonse F.; Rossini, Frederick D.,
Physical Properties of n-Hexadecane, n-Decylcyclopentane, n-Decylcyclohexane, 1-Hexadecene and n-Decylbenzene,
J. Phys. Chem., 1954, 58, 5, 440-442, https://doi.org/10.1021/j150515a015
. [all data]
Domalski and Hearing, 1996
Domalski, Eugene S.; Hearing, Elizabeth D.,
Heat Capacities and Entropies of Organic Compounds in the Condensed Phase. Volume III,
J. Phys. Chem. Ref. Data, 1996, 25, 1, 1, https://doi.org/10.1063/1.555985
. [all data]