Cyclopentane, octyl-
- Formula: C13H26
- Molecular weight: 182.3455
- IUPAC Standard InChIKey: HARXDULSBROLME-UHFFFAOYSA-N
- CAS Registry Number: 1795-20-6
- Chemical structure:
View 3d structure (requires JavaScript / HTML 5) - Other names: octylcyclopentane; n-Octylcyclopentane

Gas phase thermochemistry data

Data compiled by: Hussein Y. Afeefy, Joel F. Liebman, and Stephen E. Stein
Quantity | Value | Units | Method | Reference | Comment |
---|---|---|---|---|---|
ΔfH°gas | -250.7 ± 1.9 | kJ/mol | Ccb | Prosen, Johnson, et al., 1946 | Heat of combustion of the gas |

Condensed phase thermochemistry data

Data compiled by: Hussein Y. Afeefy, Joel F. Liebman, and Stephen E. Stein
Quantity | Value | Units | Method | Reference | Comment |
---|---|---|---|---|---|
ΔcH°liquid | -8580.8 ± 1.8 | kJ/mol | Ccb | Prosen, Johnson, et al., 1946 | Heat of combustion of the gas; Corresponding ΔfHºliquid = -250.6 kJ/mol (simple calculation by NIST; no Washburn corrections) |

Phase change data

Data compiled as indicated in comments:
TRC - Thermodynamics Research Center, NIST Boulder Laboratories, Chris Muzny director
AC - William E. Acree, Jr., James S. Chickos
Quantity | Value | Units | Method | Reference | Comment |
---|---|---|---|---|---|
Tfus | 228.7 | K | N/A | Schmidt, 1942 | Uncertainty assigned by TRC = 0.5 K; TRC |
Tfus | 228.7 | K | N/A | Schmidt and Gemassmer, 1940 | Uncertainty assigned by TRC = 2. K; TRC |
Quantity | Value | Units | Method | Reference | Comment |
ΔvapH° | 65.8 | kJ/mol | N/A | Reid, 1972 | AC |

Normal alkane RI, non-polar column, temperature ramp

Data compiled by: NIST Mass Spectrometry Data Center, William E. Wallace, director

Column type Capillary
Active phase SP-2100
Column length (m) 30.
Carrier gas He
Substrate
Column diameter (mm) 0.25
Phase thickness (μm)
Tstart (C) 40.
Tend (C) 250.
Heat rate (K/min) 4.
Initial hold (min)
Final hold (min)
I 1337.
ReferenceAlencar, Alves, et al., 1983
Comment MSDC-RI

References

Prosen, Johnson, et al., 1946
Prosen, E.J.; Johnson, W.H.; Rossini, F.D.,
Heats of formation and combustion of the normal alkylcyclopentanes and cyclohexanes and the increment per CH2 group for several homologous series of hydrocarbons,
J. Res. NBS, 1946, 37, 51-56. [all data]
Schmidt, 1942
Schmidt, A.W.,
Physical properties of aliphatic compounds,
Ber. Dtsch. Chem. Ges. B, 1942, 75, 1399. [all data]
Schmidt and Gemassmer, 1940
Schmidt, A.W.; Gemassmer, A.,
Physical data of monoalkylcyclopentanes ???.,
Ber. Dtsch. Chem. Ges. B, 1940, 73, 359-66. [all data]
Reid, 1972
Reid, Robert C.,
Handbook on vapor pressure and heats of vaporization of hydrocarbons and related compounds, R. C. Wilhort and B. J. Zwolinski, Texas A Research Foundation. College Station, Texas(1971). 329 pages.$10.00,
AIChE J., 1972, 18, 6, 1278-1278, https://doi.org/10.1002/aic.690180637
. [all data]