Cyclohexane, tetradecyl-
- Formula: C20H40
- Molecular weight: 280.5316
- IUPAC Standard InChIKey: NQAVPKIJZCHUNS-UHFFFAOYSA-N
- CAS Registry Number: 1795-18-2
- Chemical structure:
View 3d structure (requires JavaScript / HTML 5) - Other names: n-Tetradecylcyclohexane; Tetradecylcyclohexane; n-tetradecycyclohexane

Gas phase thermochemistry data

Data compiled by: Hussein Y. Afeefy, Joel F. Liebman, and Stephen E. Stein
Quantity | Value | Units | Method | Reference | Comment |
---|---|---|---|---|---|
ΔfH°gas | -419.3 ± 3.3 | kJ/mol | Ccb | Prosen, Johnson, et al., 1946 |

Condensed phase thermochemistry data

Data compiled by: Hussein Y. Afeefy, Joel F. Liebman, and Stephen E. Stein
Quantity | Value | Units | Method | Reference | Comment |
---|---|---|---|---|---|
ΔcH°liquid | -13167.8 ± 3.0 | kJ/mol | Ccb | Prosen, Johnson, et al., 1946 | Corresponding ΔfHºliquid = -419.03 kJ/mol (simple calculation by NIST; no Washburn corrections) |

Phase change data

Data compiled as indicated in comments:
TRC - Thermodynamics Research Center, NIST Boulder Laboratories, Chris Muzny director
AC - William E. Acree, Jr., James S. Chickos
Quantity | Value | Units | Method | Reference | Comment |
---|---|---|---|---|---|
Tboil | 611. | K | N/A | Schlenk, 1951 | Uncertainty assigned by TRC = 4. K; TRC |
Quantity | Value | Units | Method | Reference | Comment |
Tfus | 298. | K | N/A | Schmidt, 1942 | Uncertainty assigned by TRC = 1.5 K; TRC |
Quantity | Value | Units | Method | Reference | Comment |
ΔvapH° | 99.4 | kJ/mol | N/A | Reid, 1972 | AC |
Enthalpy of vaporization
ΔvapH (kJ/mol) | Temperature (K) | Reference | Comment |
---|---|---|---|
74.7 | 501. | Dykyj, Svoboda, et al., 1999 | Based on data from 486. to 665. K.; AC |

Kovats' RI, polar column, isothermal

Data compiled by: NIST Mass Spectrometry Data Center, William E. Wallace, director

Column type Capillary
Active phase Carbowax 20M
Column length (m) 30.
Carrier gas He
Substrate
Column diameter (mm) 0.25
Phase thickness (μm)
Temperature (C) 170.
I 2106.
ReferenceKusmierz, Malinski, et al., 1985
Comment MSDC-RI

References

Prosen, Johnson, et al., 1946
Prosen, E.J.; Johnson, W.H.; Rossini, F.D.,
Heats of formation and combustion of the normal alkylcyclopentanes and cyclohexanes and the increment per CH2 group for several homologous series of hydrocarbons,
J. Res. NBS, 1946, 37, 51-56. [all data]
Schlenk, 1951
Schlenk, W.,
Justus Liebigs Ann. Chem., 1951, 573, 142-62. [all data]
Schmidt, 1942
Schmidt, A.W.,
Physical properties of aliphatic compounds,
Ber. Dtsch. Chem. Ges. B, 1942, 75, 1399. [all data]
Reid, 1972
Reid, Robert C.,
Handbook on vapor pressure and heats of vaporization of hydrocarbons and related compounds, R. C. Wilhort and B. J. Zwolinski, Texas A Research Foundation. College Station, Texas(1971). 329 pages.$10.00,
AIChE J., 1972, 18, 6, 1278-1278, https://doi.org/10.1002/aic.690180637
. [all data]
Dykyj, Svoboda, et al., 1999
Dykyj, J.; Svoboda, J.; Wilhoit, R.C.; Frenkel, M.L.; Hall, K.R.,
Vapor Pressure of Chemicals: Part A. Vapor Pressure and Antoine Constants for Hydrocarbons and Sulfur, Selenium, Tellurium and Hydrogen Containing Organic Compounds, Springer, Berlin, 1999, 373. [all data]