Thiophene, tetrahydro-2-methyl-
- Formula: C5H10S
- Molecular weight: 102.198
- IUPAC Standard InChIKey: AJPGNQYBSTXCJE-UHFFFAOYSA-N
- CAS Registry Number: 1795-09-1
- Chemical structure:
View 3d structure (requires JavaScript / HTML 5) - Other names: 2-Methylthiolane; Tetrahydro-2-methylthiophene; 2-Methyltetrahydrothiophene; 2-Methylthiacyclopentane; 2-Methylthiophane; Tetrahydrothiophene, 2-methyl-

Gas phase thermochemistry data

Data compiled by: Hussein Y. Afeefy, Joel F. Liebman, and Stephen E. Stein
Quantity | Value | Units | Method | Reference | Comment |
---|---|---|---|---|---|
ΔfH°gas | -63.89 ± 0.75 | kJ/mol | Ccr | Good, 1972 |

Condensed phase thermochemistry data

Data compiled as indicated in comments:
ALS - Hussein Y. Afeefy, Joel F. Liebman, and Stephen E. Stein
DH - Eugene S. Domalski and Elizabeth D. Hearing
Quantity | Value | Units | Method | Reference | Comment |
---|---|---|---|---|---|
ΔfH°liquid | -105.1 ± 0.71 | kJ/mol | Ccr | Good, 1972 | ALS |
Quantity | Value | Units | Method | Reference | Comment |
ΔcH°liquid | -3893.6 ± 0.63 | kJ/mol | Ccr | Good, 1972 | Reanalyzed by Pedley, Naylor, et al., 1986, Original value = -3893.1 ± 0.63 kJ/mol; ALS |
Quantity | Value | Units | Method | Reference | Comment |
S°liquid | 245.31 | J/mol*K | N/A | Messerly, Finke, et al., 1974 | DH |
Constant pressure heat capacity of liquid
Cp,liquid (J/mol*K) | Temperature (K) | Reference | Comment |
---|---|---|---|
171.80 | 298.15 | Messerly, Finke, et al., 1974 | T = 10 to 380 K.; DH |

Phase change data

Data compiled as indicated in comments:
TRC - Thermodynamics Research Center, NIST Boulder Laboratories, Chris Muzny director
ALS - Hussein Y. Afeefy, Joel F. Liebman, and Stephen E. Stein
DRB - Donald R. Burgess, Jr.
AC - William E. Acree, Jr., James S. Chickos
DH - Eugene S. Domalski and Elizabeth D. Hearing
Quantity | Value | Units | Method | Reference | Comment |
---|---|---|---|---|---|
Ttriple | 172.39 | K | N/A | Messerly, Finke, et al., 1974, 2 | Uncertainty assigned by TRC = 0.02 K; TRC |
Quantity | Value | Units | Method | Reference | Comment |
ΔvapH° | 41.3 ± 0.2 | kJ/mol | V | Good, 1972 | ALS |
ΔvapH° | 41.2 | kJ/mol | N/A | Good, 1972 | DRB |
ΔvapH° | 41.3 ± 0.1 | kJ/mol | N/A | Good, 1972 | See also Osborn and Douslin, 1966.; AC |
ΔvapH° | 41.8 | kJ/mol | N/A | Reid, 1972 | AC |
Enthalpy of vaporization
ΔvapH (kJ/mol) | Temperature (K) | Method | Reference | Comment |
---|---|---|---|---|
40.6 | 318. | N/A | Dykyj, Svoboda, et al., 1999 | Based on data from 303. to 433. K.; AC |
39. | 350. | A,EB | Stephenson and Malanowski, 1987 | Based on data from 335. to 447. K. See also Osborn and Douslin, 1966.; AC |
38.7 | 356. | N/A | White, Barnard--Smith, et al., 1952 | Based on data from 341. to 411. K.; AC |
Antoine Equation Parameters
log10(P) = A − (B / (T + C))
P = vapor pressure (bar)
T = temperature (K)
View plot Requires a JavaScript / HTML 5 canvas capable browser.
Temperature (K) | A | B | C | Reference |
---|---|---|---|---|
335.78 to 446.24 | 4.06902 | 1409.503 | -58.742 | Osborn and Douslin, 1966 |
Enthalpy of fusion
ΔfusH (kJ/mol) | Temperature (K) | Reference | Comment |
---|---|---|---|
8.8759 | 172.39 | Messerly, Finke, et al., 1974 | DH |
8.87 | 172.4 | Messerly, Finke, et al., 1974 | See also Domalski and Hearing, 1996.; AC |
Entropy of fusion
ΔfusS (J/mol*K) | Temperature (K) | Reference | Comment |
---|---|---|---|
51.49 | 172.39 | Messerly, Finke, et al., 1974 | DH |

Van Den Dool and Kratz RI, non-polar column, temperature ramp

Data compiled by: NIST Mass Spectrometry Data Center, William E. Wallace, director

Column type Capillary
Active phase BPX-5
Column length (m) 50.
Carrier gas He
Substrate
Column diameter (mm) 0.32
Phase thickness (μm) 0.50
Tstart (C) 40.
Tend (C) 280.
Heat rate (K/min) 4.
Initial hold (min)
Final hold (min)
I 866.
ReferenceAaslyng, Elmore, et al., 1998
Comment MSDC-RI

Kovats' RI, non-polar column, isothermal

View large format table.

Column type Active phase Temperature (C) I Reference Comment
PackedApiezon M130.870.Garbuzov, Misharina, et al., 1985He or N2, Chromosorb W, AW-DMCS; Column length: 2.1 m
CapillaryOV-101100.851.Gal'pern, Gollandskikh, et al., 1976H2; Column length: 100. m; Column diameter: 0.25 mm
CapillarySqualane86.850.Agr, Tesaric, et al., 1973
CapillarySqualane86.850.Agrawal, Tesarík, et al., 1972N2, Celite 545; Column length: 50. m; Column diameter: 0.3 mm
PackedApiezon L130.885.Martinu and Janák, 1970

Van Den Dool and Kratz RI, polar column, temperature ramp

View large format table.

Column type Active phase I Reference Comment
CapillaryDB-Wax1112.Chung, Eiserich, et al., 1994He, 60. C @ 4. min, 3. K/min, 220. C @ 30. min; Column length: 60. m; Column diameter: 0.25 mm

Normal alkane RI, non-polar column, temperature ramp

View large format table.

Column type Active phase I Reference Comment
CapillaryPONA827.Yang, Yang, et al., 200350. m/0.20 mm/0.50 μm, Helium, 2. K/min; Tstart: 30. C; Tend: 170. C
CapillaryCP-Sil 5822.Damste, van Dalen, et al., 198825. m/0.32 mm/0.45 μm, Helium, 0. C @ 5. min, 3. K/min; Tend: 300. C
CapillaryCP-Sil 5822.Damste, van Dalen, et al., 198825. m/0.32 mm/0.45 μm, Helium, 0. C @ 5. min, 3. K/min; Tend: 300. C
CapillaryCP-Sil 5825.Damste, van Dalen, et al., 198825. m/0.32 mm/0.45 μm, Helium, 0. C @ 5. min, 3. K/min; Tend: 300. C
CapillaryCP Sil 5 CB822.Damste, Kock-van Dalen, et al., 198825. m/0.32 mm/0.45 μm, He, 3. K/min; Tstart: 50. C; Tend: 300. C
CapillaryCP Sil 5 CB825.Damste, Kock-van Dalen, et al., 198825. m/0.32 mm/0.45 μm, He, 3. K/min; Tstart: 50. C; Tend: 300. C
CapillaryOV-101851.Limin, Jichun, et al., 198875. C @ 8. min, 2. K/min; Column length: 25. m; Column diameter: 0.25 mm; Tend: 130. C

Normal alkane RI, non-polar column, custom temperature program

View large format table.

Column type Active phase I Reference Comment
CapillaryMethyl Silicone845.Farkas, Héberger, et al., 2004Program: not specified
CapillarySE-52879.van Langenhove and Schamp, 1986Column length: 100. m; Column diameter: 0.50 mm; Program: not specified

Normal alkane RI, polar column, temperature ramp

View large format table.

Column type Active phase I Reference Comment
CapillaryDB-Wax1116.Umano, Hagi, et al., 1995He, 40. C @ 2. min, 2. K/min; Column length: 60. m; Column diameter: 0.25 mm; Tend: 200. C

References

Good, 1972
Good, W.D.,
Enthalpies of combustion of 18 organic sulfur compounds related to petroleum,
J. Chem. Eng. Data, 1972, 17, 158-162. [all data]
Pedley, Naylor, et al., 1986
Pedley, J.B.; Naylor, R.D.; Kirby, S.P.,
Thermochemical Data of Organic Compounds, Chapman and Hall, New York, 1986, 1-792. [all data]
Messerly, Finke, et al., 1974
Messerly, J.F.; Finke, H.L.; Todd, S.S.,
Low-temperature thermal studies on six organo-sulfur compounds,
J. Chem. Thermodynam., 1974, 6, 635-657. [all data]
Messerly, Finke, et al., 1974, 2
Messerly, J.F.; Finke, H.L.; Todd, S.S.,
Low-temperature thermal sudies on six organo-sulfur compounds,
J. Chem. Thermodyn., 1974, 6, 635-57. [all data]
Osborn and Douslin, 1966
Osborn, A.G.; Douslin, D.R.,
Vapor Pressure Relations of 36 Sulfur Compounds Present in Petroleum.,
J. Chem. Eng. Data, 1966, 11, 4, 502-509, https://doi.org/10.1021/je60031a014
. [all data]
Reid, 1972
Reid, Robert C.,
Handbook on vapor pressure and heats of vaporization of hydrocarbons and related compounds, R. C. Wilhort and B. J. Zwolinski, Texas A Research Foundation. College Station, Texas(1971). 329 pages.$10.00,
AIChE J., 1972, 18, 6, 1278-1278, https://doi.org/10.1002/aic.690180637
. [all data]
Dykyj, Svoboda, et al., 1999
Dykyj, J.; Svoboda, J.; Wilhoit, R.C.; Frenkel, M.L.; Hall, K.R.,
Vapor Pressure of Chemicals: Part A. Vapor Pressure and Antoine Constants for Hydrocarbons and Sulfur, Selenium, Tellurium and Hydrogen Containing Organic Compounds, Springer, Berlin, 1999, 373. [all data]
Stephenson and Malanowski, 1987
Stephenson, Richard M.; Malanowski, Stanislaw,
Handbook of the Thermodynamics of Organic Compounds, 1987, https://doi.org/10.1007/978-94-009-3173-2
. [all data]
White, Barnard--Smith, et al., 1952
White, P.T.; Barnard--Smith, D.G.; Fidler, F.A.,
Vapor Pressure--Temperature Relationships of Sulfur Compounds Related to Petroleum,
Ind. Eng. Chem., 1952, 44, 6, 1430-1438, https://doi.org/10.1021/ie50510a064
. [all data]
Domalski and Hearing, 1996
Domalski, Eugene S.; Hearing, Elizabeth D.,
Heat Capacities and Entropies of Organic Compounds in the Condensed Phase. Volume III,
J. Phys. Chem. Ref. Data, 1996, 25, 1, 1, https://doi.org/10.1063/1.555985
. [all data]