N-(1,1-dimethylethyl)-1,1,1-triethylsilanamine

Phase change data

Data compiled by: William E. Acree, Jr., James S. Chickos

Quantity Value Units Method Reference Comment
Δvap40.3 ± 0.9kJ/molCVoronkov, Klyuchnikov, et al., 1991

References

Voronkov, Klyuchnikov, et al., 1991
Voronkov, M.G.; Klyuchnikov, V.A.; Marenkova, L.I.; Danilova, T.F.; Shvets, G.N.; Tsvetnitskaya, S.I.; Khudobin, Yu.I., Thermochemistry of organosilicon compounds, Journal of Organometallic Chemistry, 1991, 406, 1-2, 99-104, https://doi.org/10.1016/0022-328X(91)83175-4 . [all data]