Bicyclo[3.3.1]nonan-9-one
- Formula: C9H14O
- Molecular weight: 138.2069
- IUPAC Standard InChIKey: SKTMMSQPXGWCAP-UHFFFAOYSA-N
- CAS Registry Number: 17931-55-4
- Chemical structure:
View 3d structure (requires JavaScript / HTML 5) - Other names: Bicyclo[3.3.1]nona-9-one

Gas phase thermochemistry data

Data compiled by: Hussein Y. Afeefy, Joel F. Liebman, and Stephen E. Stein
Quantity | Value | Units | Method | Reference | Comment |
---|---|---|---|---|---|
ΔfH°gas | -240. ± 8.4 | kJ/mol | Ccb | Steele, 1979 |

Phase change data

Data compiled by: Eugene S. Domalski and Elizabeth D. Hearing
Enthalpy of phase transition
ΔHtrs (kJ/mol) | Temperature (K) | Initial Phase | Final Phase | Reference | Comment |
---|---|---|---|---|---|
14.110 | 300.5 | crystaline, II | crystaline, I | White and Perrott, 1991 |
Entropy of phase transition
ΔStrs (J/mol*K) | Temperature (K) | Initial Phase | Final Phase | Reference | Comment |
---|---|---|---|---|---|
46.99 | 300.5 | crystaline, II | crystaline, I | White and Perrott, 1991 |

References

Steele, 1979
Steele, W.V.,
Thermochemically determined ΔH°f(g) values for ketones and alcohols,
Private Communication, University of Stirling, Stirling, Scotland, 1979, 0. [all data]
White and Perrott, 1991
White, M.A.; Perrott, A.,
Polymorphism in Bicyclo[3.3.1]nonan-9-one: A molecular solid that can exist in both its ordered and its disordered phases at room temperature,
J. Solid State Chem., 1991, 90(1), 87-91. [all data]