1-Hexanol, TMS derivative
- Formula: C9H22OSi
- Molecular weight: 174.3559
- IUPAC Standard InChIKey: HNVBZKNIPZVUDV-UHFFFAOYSA-N
- CAS Registry Number: 17888-62-9
- Chemical structure:
View 3d structure (requires JavaScript / HTML 5) - Other names: Silane, (hexyloxy)trimethyl-; (Hexyloxy)trimethylsilane; Hexyl alcohol, trimethylsilyl ether; Silane, trimethyl, hexyloxy

Kovats' RI, non-polar column, isothermal

Column type | Active phase | Temperature (C) | I | Reference | Comment |
---|---|---|---|---|---|
Packed | Apiezon M | 160. | 932. | Peetre, Ellren, et al., 1985 | Chromosorb G; Column length: 3. m |
Packed | SE-30 | 100. | 982. | Zarazir, Chovin, et al., 1970 | Chromosorb W; Column length: 2. m |

Kovats' RI, polar column, isothermal

Column type | Active phase | Temperature (C) | I | Reference | Comment |
---|---|---|---|---|---|
Packed | Carbowax 20M | 100. | 1007. | Zarazir, Chovin, et al., 1970 | Chromosorb W; Column length: 2. m |

Van Den Dool and Kratz RI, non-polar column, custom temperature program

Column type | Active phase | I | Reference | Comment |
---|---|---|---|---|
Capillary | VF-5MS | 986.4 | Tret'yakov, 2007 | 30. m/0.25 mm/0.25 μm, He; Program: Multi-step temperature program; T(initial)=60C; T(final)=270C |

Normal alkane RI, non-polar column, isothermal

Column type | Active phase | Temperature (C) | I | Reference | Comment |
---|---|---|---|---|---|
Packed | Apieson M | 160. | 932. | Ellren, Peetre, et al., 1974 | Chromosorb G AW DMCS (80-100 mesh) |

References

Peetre, Ellren, et al., 1985
Peetre, I.-B.; Ellren, O.; Smith, B.E.F.,
Gas chromatographic investigation of organometallic compounds and their carbon analogues. VI. Determination, calculation and correlation of Kováts retention indices for alkylalkoxysilanes,
J. Chromatogr., 1985, 318, 41-55, https://doi.org/10.1016/S0021-9673(01)90662-4
. [all data]
Zarazir, Chovin, et al., 1970
Zarazir, D.; Chovin, P.; Guiochon, G.,
Identification of hydroxylic compounds and their derivatives by gas chromatography,
Chromatographia, 1970, 3, 4, 180-195, https://doi.org/10.1007/BF02269018
. [all data]
Tret'yakov, 2007
Tret'yakov, K.V.,
Retention Data. NIST Mass Spectrometry Data Center., NIST Mass Spectrometry Data Center, 2007. [all data]
Ellren, Peetre, et al., 1974
Ellren, O.; Peetre, I.B.; Smith, B.E.F.,
Gas chromatographic investigation of organometallic compounds and their carbon analogues. V. Use of refractive index in conjunction with Kovats retention index for the identification of organosilicon compounds,
J. Chromatogr., 1974, 93, 2, 383-392, https://doi.org/10.1016/S0021-9673(01)85402-9
. [all data]