4-Bromophenol, TMS derivative
- Formula: C9H13BrOSi
- Molecular weight: 245.188
- IUPAC Standard InChIKey: HWKPTBHJWBSOOP-UHFFFAOYSA-N
- CAS Registry Number: 17878-44-3
- Chemical structure:
View 3d structure (requires JavaScript / HTML 5) - Other names: Silane, (4-bromophenoxy)trimethyl-; 4-Trimethylsilyloxybromobenzene; 4-Bromotrimethylsiloxybenzene; p-Bromophenoxytrimethylsilane; p-Trimethylsiloxy bromobenzene; (4-Bromophenoxy)(trimethyl)silane; 4-Bromophenol, trimethylsilyl ether

Phase change data

Data compiled by: Robert L. Brown and Stephen E. Stein
Reduced pressure boiling point
Tboil (K) | Pressure (atm) | Reference |
---|---|---|
399. | 0.033 | PCR Inc., 1990 |

References

PCR Inc., 1990
PCR Inc.,
Research Chemicals Catalog 1990-1991, PCR Inc., Gainesville, FL, 1990, 1. [all data]