Benzene, 1,1',1'',1''',1'''',1'''''-(1,2-ethanediylidyne)hexakis-
- Formula: C38H30
- Molecular weight: 486.6448
- IUPAC Standard InChIKey: IYDPHZDMGCHZFB-UHFFFAOYSA-N
- CAS Registry Number: 17854-07-8
- Chemical structure:
View 3d structure (requires JavaScript / HTML 5) - Other names: Hexaphenylethane; Ethane, hexaphenyl-

Condensed phase thermochemistry data

Data compiled by: Hussein Y. Afeefy, Joel F. Liebman, and Stephen E. Stein
Quantity | Value | Units | Method | Reference | Comment |
---|---|---|---|---|---|
ΔfH°solid | 619.2 | kJ/mol | Ccb | Schmidin, 1904 | |
Quantity | Value | Units | Method | Reference | Comment |
ΔcH°solid | -19920. | kJ/mol | Ccb | Schmidin, 1904 | Corresponding ΔfHºsolid = 674. kJ/mol (simple calculation by NIST; no Washburn corrections) |

Reaction thermochemistry data

Data compiled by: Hussein Y. Afeefy, Joel F. Liebman, and Stephen E. Stein
Individual Reactions
By formula: H2 + C38H30 = 2C19H16
Quantity | Value | Units | Method | Reference | Comment |
---|---|---|---|---|---|
ΔrH° | -169. ± 3. | kJ/mol | Chyd | Bent and Cuthbertson, 1936 | liquid phase |
ΔrH° | -146. | kJ/mol | Chyd | Bent and Cuthbertson, 1936 | liquid phase; solvent: Ethylacetate |
By formula: C38H30 + O2 = C38H30O2
Quantity | Value | Units | Method | Reference | Comment |
---|---|---|---|---|---|
ΔrH° | -190.4 ± 2.1 | kJ/mol | Cm | Bent, Cuthbertson, et al., 1936 | solid phase; Heat of oxidation |

References

Schmidin, 1904
Schmidin, M.J.,
Chaleurs de combustion du triphenylmethyle et de quelques derives du triphenylmethane,
Compt. Rend., 1904, 139, 732-733. [all data]
Bent and Cuthbertson, 1936
Bent, H.E.; Cuthbertson, G.R.,
Single bond energies. II. The C-C bond in hexaphenylethane,
J. Am. Chem. Soc., 1936, 58, 170-173. [all data]
Bent, Cuthbertson, et al., 1936
Bent, H.E.; Cuthbertson, G.R.; Dorfman, M.; Leary, R.E.,
Single bond energies. I. The C-C bond in hexaphenylethane,
J. Am. Chem. Soc., 1936, 58, 165-170. [all data]