1,3,5-Triphenyl-s-triazine-2,4,6(1H,3H,5H)-trione
- Formula: C21H15N3O3
- Molecular weight: 357.3621
- IUPAC Standard InChIKey: YEACGXMAEGBJSM-UHFFFAOYSA-N
- CAS Registry Number: 1785-02-0
- Chemical structure:
View 3d structure (requires JavaScript / HTML 5) - Other names: s-Triazine-2,4,6(1H,3H,5H)-trione, 1,3,5-triphenyl-; Phenyl isocyanate trimer; Phenyl isocyanurate; Triphenyl isocyanurate; 1,3,5-Triazine-2,4,6(1H,3H,5H)-trione, 1,3,5-triphenyl-; 1,3,5-Triphenyl-1,3,5-perhydro-triazine-2,4,6-trione; 1,3,5-Triphenyl-perhydro-1,3,5-triazine-2,4,6-trione; 1,3,5-Triphenyl-s-triazine-2,4,6-trione; 1,3,5-Triphenyl-1,3,5-triazine-2,4,6-trione; Phenyl isocyanate cyclic trimer; 1,3,5-Triphenyl-2,4,6-triazinetrione; s-Triazine-2,4,6(1H,3H,5H)-trione, triphenyl-; 1,3,5-Triphenyl-1,3,5-triazine-2,4,6(1H,3H,5H)-trione; Triazintrione, 1,3,5-triphenyl-; 1,3,5-Triphenyl isocyanurate; N,N',N''-Triphenyl isocyanurate; NSC 105886; NSC 82068

Condensed phase thermochemistry data

Data compiled by: Hussein Y. Afeefy, Joel F. Liebman, and Stephen E. Stein
Quantity | Value | Units | Method | Reference | Comment |
---|---|---|---|---|---|
ΔfH°solid | -344. ± 3. | kJ/mol | Cm | Bykova, Lebedev, et al., 1985 | Different experiment |
ΔfH°solid | -344. ± 3. | kJ/mol | Ccb | Lebedev, Rabinovich, et al., 1977 | Different experiment |
Quantity | Value | Units | Method | Reference | Comment |
ΔcH°solid | -10063. ± 3. | kJ/mol | Ccb | Lebedev, Rabinovich, et al., 1977 | Different experiment |

Reaction thermochemistry data

Data compiled by: Hussein Y. Afeefy, Joel F. Liebman, and Stephen E. Stein
Individual Reactions
By formula: 3C7H5NO = C21H15N3O3
Quantity | Value | Units | Method | Reference | Comment |
---|---|---|---|---|---|
ΔrH° | -51.8 ± 2.9 | kJ/mol | Cm | Bonetskaya, Kravchenko, et al., 1985 | liquid phase; solvent: Diglyme; Trimerization |
ΔrH° | 80.8 | kJ/mol | Cm | Bykova, Lebedev, et al., 1985 | liquid phase; Different experiment |
By formula: C21H15N3O3 = 3C7H5NO
Quantity | Value | Units | Method | Reference | Comment |
---|---|---|---|---|---|
ΔrH° | -80.8 | kJ/mol | Cm | Bykova, Lebedev, et al., 1985 | solid phase; Different experiment |

References

Bykova, Lebedev, et al., 1985
Bykova, T.A.; Lebedev, B.V.; Kiparisova, E.G.; Tarasov, E.N.; Frenkel, Ts.M.; Pankratov, V.A.; Vinogradova, S.V.; Korshank, V.V.,
Thermodynamics of phenyl isocyanate, the process of its cyclotrimerization, and the triphenyl isocyanurate that is formed, in the 0-330°K interval,
J. Gen. Chem. USSR, 1985, 55, 2303-2308. [all data]
Lebedev, Rabinovich, et al., 1977
Lebedev, B.V.; Rabinovich, I.B.; Kiparisova, E.G.; Evstropov, A.A.; Korshak, V.V.; Pankratov, V.A.; Larina, L.F.,
Thermodynamics of the polycyclotrimerization of aromatic dicyanates and diisocyanates,
Dokl. Phys. Chem. (Engl. Transl.), 1977, 237, 1081-1084, In original 383. [all data]
Bonetskaya, Kravchenko, et al., 1985
Bonetskaya, A.K.; Kravchenko, M.A.; Frenkel, Ts.M.; Pankratov, V.A.; Vinogradova, S.V.; Korshak, V.V.,
Kinetics and heat of cyclotrimerization of aryl and alkyl isocyanates,
Vysokomol. Soedin., Ser. A, 1985, 27, 1269-1273. [all data]
Lang (editor), 1969
Lang (editor), L.,
Absorption Spectra in the Ultraviolet and Visible Region, 1969, 12, 295. [all data]