D-Aspartic acid
- Formula: C4H7NO4
- Molecular weight: 133.1027
- IUPAC Standard InChIKey: CKLJMWTZIZZHCS-REOHCLBHSA-N
- CAS Registry Number: 1783-96-6
- Chemical structure:
View 3d structure (requires JavaScript / HTML 5) - Stereoisomers:
- Other names: (-)-Aspartic acid; NSC 97922; D-(-)-Aspartic acid; Aspartic acid D-form; (R)-Aspartic acid; Asp

Gas phase ion energetics data

Data compiled by: Michael M. Meot-Ner (Mautner)
Proton affinity at 298K
Proton affinity (kJ/mol) | Reference | Comment |
---|---|---|
916.3 | Bojesen and Breindahl, 1994 | PA increased by 0.9 kcal/mol for referencing values to Hunter and Lias, 1998 |

References

Bojesen and Breindahl, 1994
Bojesen, G.; Breindahl, T.,
On the Proton Affinity od Some Alpha-Amino Acids and the Theory of the Kinetic Method.,
J. Chem. Soc. Perkin 2, 1994, 1029. [all data]
Hunter and Lias, 1998
Hunter, E.P.; Lias, S.G.,
Evaluated Gas Phase Basicities and Proton Affinities of Molecules: An Update,
J. Phys. Chem. Ref. Data, 1998, 27, 3, 413-656, https://doi.org/10.1063/1.556018
. [all data]