Benzenamine, 3-(methylthio)-
- Formula: C7H9NS
- Molecular weight: 139.218
- IUPAC Standard InChIKey: KCHLDNLIJVSRPK-UHFFFAOYSA-N
- CAS Registry Number: 1783-81-9
- Chemical structure:
View 3d structure (requires JavaScript / HTML 5) - Other names: 3-(Methylthio)aniline; 3-Methylthiobenzenamine; 3-Methylmercaptoaniline; m-(Methylthio)aniline; m-Aminophenyl methyl sulfide; m-Aminothioanisole; Aniline, m-(methylthio)-; 3-Aminothioanisole; Aniline, 3-methylthio-; 3-CH3SC6H4NH2; 3-(Methylsulfanyl)phenylamine; NSC 66274

Phase change data

Data compiled by: Robert L. Brown and Stephen E. Stein
Reduced pressure boiling point
Tboil (K) | Pressure (bar) | Reference |
---|---|---|
437.2 | 0.021 | Aldrich Chemical Company Inc., 1990 |
436. to 438. | 0.021 | Buckingham and Donaghy, 1982 |

Reaction thermochemistry data

Data compiled by: John E. Bartmess
Individual Reactions
C7H8NS- + =
By formula: C7H8NS- + H+ = C7H9NS
Quantity | Value | Units | Method | Reference | Comment |
---|---|---|---|---|---|
ΔrH° | 1515. ± 8.8 | kJ/mol | G+TS | Bartmess, Scott, et al., 1979 | gas phase; value altered from reference due to change in acidity scale |
Quantity | Value | Units | Method | Reference | Comment |
ΔrG° | 1484. ± 8.4 | kJ/mol | IMRE | Bartmess, Scott, et al., 1979 | gas phase; value altered from reference due to change in acidity scale |

Gas phase ion energetics data

Data evaluated as indicated in comments:
HL - Edward P. Hunter and Sharon G. Lias
Data compiled as indicated in comments:
B - John E. Bartmess
Quantity | Value | Units | Method | Reference | Comment |
---|---|---|---|---|---|
Proton affinity (review) | 902.1 | kJ/mol | N/A | Hunter and Lias, 1998 | HL |
Quantity | Value | Units | Method | Reference | Comment |
Gas basicity | 870.3 | kJ/mol | N/A | Hunter and Lias, 1998 | HL |
De-protonation reactions
C7H8NS- + =
By formula: C7H8NS- + H+ = C7H9NS
Quantity | Value | Units | Method | Reference | Comment |
---|---|---|---|---|---|
ΔrH° | 1515. ± 8.8 | kJ/mol | G+TS | Bartmess, Scott, et al., 1979 | gas phase; value altered from reference due to change in acidity scale; B |
Quantity | Value | Units | Method | Reference | Comment |
ΔrG° | 1484. ± 8.4 | kJ/mol | IMRE | Bartmess, Scott, et al., 1979 | gas phase; value altered from reference due to change in acidity scale; B |

References

Aldrich Chemical Company Inc., 1990
Aldrich Chemical Company Inc.,
Catalog Handbook of Fine Chemicals, Aldrich Chemical Company, Inc., Milwaukee WI, 1990, 1. [all data]
Buckingham and Donaghy, 1982
Buckingham, J.; Donaghy, S.M.,
Dictionary of Organic Compounds: Fifth Edition, Chapman and Hall, New York, 1982, 1. [all data]
Bartmess, Scott, et al., 1979
Bartmess, J.E.; Scott, J.A.; McIver, R.T., Jr.,
The gas phase acidity scale from methanol to phenol,
J. Am. Chem. Soc., 1979, 101, 6047. [all data]
Hunter and Lias, 1998
Hunter, E.P.; Lias, S.G.,
Evaluated Gas Phase Basicities and Proton Affinities of Molecules: An Update,
J. Phys. Chem. Ref. Data, 1998, 27, 3, 413-656, https://doi.org/10.1063/1.556018
. [all data]