3-Chloro-2,2-bis(chloromethyl)propanoic acid
- Formula: C5H7Cl3O2
- Molecular weight: 205.467
- IUPAC Standard InChIKey: RDRNKIGGASXJAX-UHFFFAOYSA-N
- CAS Registry Number: 17831-70-8
- Chemical structure:

Phase change data

Data compiled by: William E. Acree, Jr., James S. Chickos
Enthalpy of fusion
ΔfusH (kJ/mol) | Temperature (K) | Reference |
---|---|---|
20.9 | 383.9 | Gotze, Buhrmester, et al., 1999 |

References

Gotze, Buhrmester, et al., 1999
Gotze, A.; Buhrmester, C.; Svoboda, I.; Fuess, H.,
Crystal structures and phase transitions of 3-chloro-2,2-bis(chloromethyl)propionic acid-1 and 1,3-dichloro-2,2-dimethylpropane,
Croatica Chim. Acta, 1999, 72, 2-3, 443. [all data]