(Z)-9-octadecene

Phase change data

Data compiled by: Thermodynamics Research Center, NIST Boulder Laboratories, Chris Muzny director

Quantity Value Units Method Reference Comment
Tfus242.7KN/AElsner and Paul, 1953Uncertainty assigned by TRC = 2. K
Tfus272.KN/ADeatherage and Olcott, 1939Uncertainty assigned by TRC = 3. K

In addition to the Thermodynamics Research Center (TRC) data available from this site, much more physical and chemical property data is available from the following TRC products:

References

Elsner and Paul, 1953
Elsner, B.B.; Paul, P.F.M., J. Chem. Soc., 1953, 1953, 3156. [all data]

Deatherage and Olcott, 1939
Deatherage, F.E.; Olcott, H.S., Synthesis of cic-9-Octadecene, 9-Octadecyne, and 9,10-Octadecane-diol, J. Am. Chem. Soc., 1939, 61, 630. [all data]