1,1,1,5,5,5-Hexafluoroacetylacetone iron(III) salt
- Formula: C15H3F18FeO6
- Molecular weight: 676.997
- IUPAC Standard InChIKey: NBPRJLXRDBDIFS-JVUUZWNBSA-K
- CAS Registry Number: 17786-67-3
- Chemical structure:

Phase change data

Data compiled by: William E. Acree, Jr., James S. Chickos
Quantity | Value | Units | Method | Reference | Comment |
---|---|---|---|---|---|
ΔsubH° | 18.9 ± 1.6 | kcal/mol | N/A | Grinberg, Lazarev, et al., 1987 |
Enthalpy of sublimation
ΔsubH (kcal/mol) | Temperature (K) | Method | Reference | Comment |
---|---|---|---|---|
12.4 | 333. to 363. | TGA | Fahlman and Barron, 2000 | |
14.3 | 333. to 363. | TGA | Fahlman and Barron, 2000 | |
18.5 ± 1.5 | 334. | BG | Grinberg, Lazarev, et al., 1987 | Based on data from 324. to 344. K. See also Lazarev, Greenberg, et al., 1988. |
26.20 ± 0.91 | 335. | N/A | Fontaine, Pommier, et al., 1972 | Based on data from 323. to 347. K. |

Gas phase ion energetics data

Data compiled as indicated in comments:
LLK - Sharon G. Lias, Rhoda D. Levin, and Sherif A. Kafafi
RDSH - Henry M. Rosenstock, Keith Draxl, Bruce W. Steiner, and John T. Herron

Ionization energy determinations

IE (eV) Method Reference Comment
9.7 ± 0.2PEWestmore, Reimer, et al., 1981LLK
9.62 ± 0.05EIWestmore, Reimer, et al., 1981LLK
10.2 ± 0.1EIReichert, Bancroft, et al., 1970RDSH
10.34 ± 0.10EISchildcrout, Pearson, et al., 1968RDSH
10.13 ± 0.07PEEvans, Hamnett, et al., 1972Vertical value; LLK
10.14PELloyd, 1970Vertical value; RDSH
8.28PELloyd, 1970Vertical value; RDSH
10.13 ± 0.03PEEvans, Hamnett, et al., 1970Vertical value; RDSH

Appearance energy determinations

Ion AE (eV) Other Products MethodReferenceComment
C10H2O4F12Fe+10.2 ± 0.1?EIReichert, Bancroft, et al., 1970RDSH
C14H3O6F15Fe+11.1 ± 0.1?EIReichert, Bancroft, et al., 1970RDSH

References

Grinberg, Lazarev, et al., 1987
Grinberg, Ya.Kh.; Lazarev, V.B.; Petukhov, V.V.; Novikova, G.Ya.; Sharpataya, G.A.; Ozerova, Z.P.,
Dokl. Akad. Nauk SSSR, 1987, 297, 633. [all data]
Fahlman and Barron, 2000
Fahlman, Bradley D.; Barron, Andrew R.,
Substituent effects on the volatility of metal ?-diketonates,
Adv. Mater. Opt. Electron., 2000, 10, 3-5, 223-232, https://doi.org/10.1002/1099-0712(200005/10)10:3/5<223::AID-AMO411>3.0.CO;2-M
. [all data]
Lazarev, Greenberg, et al., 1988
Lazarev, V.B.; Greenberg, J.H.; Ozerova, Z.P.; Sharpataya, G.A.,
DSC and vapour pressure investigation of some β-diketonates,
Journal of Thermal Analysis, 1988, 33, 3, 797-799, https://doi.org/10.1007/BF02138589
. [all data]
Fontaine, Pommier, et al., 1972
Fontaine, R.; Pommier, C.; Guiochon, G.,
Bull. Soc. Chim. Fr., 1972, 8, 3011. [all data]