Ethanone, 1-[4-(methylthio)phenyl]-
- Formula: C9H10OS
- Molecular weight: 166.240
- IUPAC Standard InChIKey: JECUZQLBQKNEMW-UHFFFAOYSA-N
- CAS Registry Number: 1778-09-2
- Chemical structure:
View 3d structure (requires JavaScript / HTML 5) - Other names: 4-(Methylthio)acetophenone; 4-CH3S-C6H4-COCH3; 1-[4-(methylthio)phenyl]ethan-1-one

Gas phase ion energetics data

Data evaluated by: Edward P. Hunter and Sharon G. Lias
Quantity | Value | Units | Method | Reference | Comment |
---|---|---|---|---|---|
Proton affinity (review) | 212.3 | kcal/mol | N/A | Hunter and Lias, 1998 | |
Quantity | Value | Units | Method | Reference | Comment |
Gas basicity | 204.7 | kcal/mol | N/A | Hunter and Lias, 1998 |

References

Hunter and Lias, 1998
Hunter, E.P.; Lias, S.G.,
Evaluated Gas Phase Basicities and Proton Affinities of Molecules: An Update,
J. Phys. Chem. Ref. Data, 1998, 27, 3, 413-656, https://doi.org/10.1063/1.556018
. [all data]