Oxygen, atomic
- Formula: O
- Molecular weight: 15.9994
- IUPAC Standard InChIKey: QVGXLLKOCUKJST-UHFFFAOYSA-N
- CAS Registry Number: 17778-80-2
- Chemical structure:
- NIST Atomic Spectra Database - Lines Holdings (on physics web site)
- NIST Atomic Spectra Database - Levels Holdings (on physics web site)
- NIST Atomic Spectra Database - Ground states and ionization energies (on physics web site)
- Electron-Impact Ionization Cross Sections (on physics web site)
- Gas Phase Kinetics Database

Gas phase thermochemistry data

Quantity | Value | Units | Method | Reference | Comment |
---|---|---|---|---|---|
ΔfH°gas | 59.555 ± 0.024 | kcal/mol | Review | Cox, Wagman, et al., 1984 | CODATA Review value |
Quantity | Value | Units | Method | Reference | Comment |
S°gas,1 bar | 38.4940 ± 0.0007 | cal/mol*K | Review | Cox, Wagman, et al., 1984 | CODATA Review value |

Ion clustering data

Data compiled by: John E. Bartmess
Clustering reactions
By formula: (HO- • 4294967295O) + O = HO-
Quantity | Value | Units | Method | Reference | Comment |
---|---|---|---|---|---|
ΔrH° | 127.44 | kcal/mol | N/A | Smith, Kim, et al., 1997 | gas phase; Given: 14741.02(3) cm-1. dHacid(0K) = 389.11±0.014 |
ΔrH° | 127.60 ± 0.20 | kcal/mol | Ther | Schulz, Mead, et al., 1982 | gas phase; Given: 1.82767±0.00021 eV |
By formula: (O2- • 4294967295O) + O = O2-
Quantity | Value | Units | Method | Reference | Comment |
---|---|---|---|---|---|
ΔrH° | 95.78 | kcal/mol | N/A | Ervin, Anusiewicz, et al., 2003 | gas phase |
ΔrH° | 95.8 ± 1.0 | kcal/mol | Ther | Travers, Cowles, et al., 1989 | gas phase |

Reaction thermochemistry data

Data compiled by: John E. Bartmess

Individual Reactions

(Hydroxyl anion • 4294967295Oxygen, atomic) + Oxygen, atomic = Hydroxyl anion

By formula: (HO- • 4294967295O) + O = HO-

Quantity Value Units Method Reference Comment
Δr127.44kcal/molN/ASmith, Kim, et al., 1997gas phase; Given: 14741.02(3) cm-1. dHacid(0K) = 389.11±0.014
Δr127.60 ± 0.20kcal/molTherSchulz, Mead, et al., 1982gas phase; Given: 1.82767±0.00021 eV

(CAS Reg. No. 661-20-1 • 4294967295Oxygen, atomic) + Oxygen, atomic = CAS Reg. No. 661-20-1

By formula: (CAS Reg. No. 661-20-1 • 4294967295O) + O = CAS Reg. No. 661-20-1

Quantity Value Units Method Reference Comment
Δr126.91kcal/molN/ABradforth, Kim, et al., 1993gas phase; D-EA cycle requires a DH ca 4 kcal/mol weaker
Δr123.35kcal/molTherWight and Beauchamp, 1980gas phase

(Oxygen anion • 4294967295Oxygen, atomic) + Oxygen, atomic = Oxygen anion

By formula: (O2- • 4294967295O) + O = O2-

Quantity Value Units Method Reference Comment
Δr95.78kcal/molN/AErvin, Anusiewicz, et al., 2003gas phase
Δr95.8 ± 1.0kcal/molTherTravers, Cowles, et al., 1989gas phase

(CAS Reg. No. 13981-20-9 • 4294967295Oxygen, atomic) + Oxygen, atomic = CAS Reg. No. 13981-20-9

By formula: (CAS Reg. No. 13981-20-9 • 4294967295O) + O = CAS Reg. No. 13981-20-9

Quantity Value Units Method Reference Comment
Δr125.2 ± 7.1kcal/molCIDTBell, Zemski, et al., 2001gas phase

(CAS Reg. No. 14380-61-1 • 4294967295Oxygen, atomic) + Oxygen, atomic = CAS Reg. No. 14380-61-1

By formula: (CAS Reg. No. 14380-61-1 • 4294967295O) + O = CAS Reg. No. 14380-61-1

Quantity Value Units Method Reference Comment
Δr33.47kcal/molN/ADistelrath and Boesl, 2000gas phase

(CAS Reg. No. 12763-66-5 • 4294967295Oxygen, atomic) + Oxygen, atomic = CAS Reg. No. 12763-66-5

By formula: (CAS Reg. No. 12763-66-5 • 4294967295O) + O = CAS Reg. No. 12763-66-5

Quantity Value Units Method Reference Comment
Δr26.44kcal/molN/AGilles, Polak, et al., 1992gas phase

(CAS Reg. No. 14380-62-2 • 4294967295Oxygen, atomic) + Oxygen, atomic = CAS Reg. No. 14380-62-2

By formula: (CAS Reg. No. 14380-62-2 • 4294967295O) + O = CAS Reg. No. 14380-62-2

Quantity Value Units Method Reference Comment
Δr32.54kcal/molN/AGilles, Polak, et al., 1992gas phase

(CAS Reg. No. 15065-65-3 • 4294967295Oxygen, atomic) + Oxygen, atomic = CAS Reg. No. 15065-65-3

By formula: (CAS Reg. No. 15065-65-3 • 4294967295O) + O = CAS Reg. No. 15065-65-3

Quantity Value Units Method Reference Comment
Δr40.19kcal/molN/AGilles, Polak, et al., 1991gas phase

Gas phase ion energetics data

Data evaluated as indicated in comments:
HL - Edward P. Hunter and Sharon G. Lias
L - Sharon G. Lias

Data compiled as indicated in comments:
B - John E. Bartmess
LL - Sharon G. Lias and Joel F. Liebman
LBLHLM - Sharon G. Lias, John E. Bartmess, Joel F. Liebman, John L. Holmes, Rhoda D. Levin, and W. Gary Mallard
LLK - Sharon G. Lias, Rhoda D. Levin, and Sherif A. Kafafi
RDSH - Henry M. Rosenstock, Keith Draxl, Bruce W. Steiner, and John T. Herron

Quantity Value Units Method Reference Comment
IE (evaluated)13.61806eVN/AN/AL
Quantity Value Units Method Reference Comment
Proton affinity (review)116.0kcal/molN/AHunter and Lias, 1998HL
Quantity Value Units Method Reference Comment
Gas basicity109.8kcal/molN/AHunter and Lias, 1998HL

Electron affinity determinations

EA (eV) Method Reference Comment
1.439157 ± 0.000004LPDJoiner, Mohr, et al., 2011Given: 11607.75(28) cm-1. In 1.0 T field, 0.5 kcal/mol lower than "best" EA; B
1.4610 ± 0.0010LPESCavanagh, Gibson, et al., 2007B
1.460982 ± 0.000044LPDBlondel, Chaibi, et al., 2005(16)O: 1.4611135(12) eV: revised analysis of Blondel, Delsart, et al., 2001; B
1.461112 ± 0.000044LPDNeumark, Lykke, et al., 1985Given: 1.461122(3) eV; revised to 1.4611107(17) eV, 95BLO, based on missing term+86CODATA; B
1.461112 ± 0.000044N/AValli, Blondel, et al., 199916O: 11784.682(20) cm-1; 18O: 11784.612(29) cm-1 or 8.7μeV lower.; B

Ionization energy determinations

IE (eV) Method Reference Comment
13.61806EVALLide, 1992LL
13.618SKelly, 1987LBLHLM
13.0 ± 0.5EIBanon, Chatillon, et al., 1982LBLHLM
13.618PIRadler and Berkowitz, 1977LLK
14. ± 1.EIPaule, 1976LLK
14.0 ± 0.5EIHildenbrand, 1975LLK
13.618SCermak, 1975LLK
13.61806SMoore, 1970RDSH
13.62PEJonathan, Morris, et al., 1970RDSH

Anion protonation reactions

O- + Hydrogen cation = Hydroxyl radical

By formula: O- + H+ = HO

Quantity Value Units Method Reference Comment
Δr382.600 ± 0.010kcal/molD-EANeumark, Lykke, et al., 1985gas phase; Given: 1.461122(3) eV; revised to 1.4611107(17) eV, 95BLO, based on missing term+86CODATA; B
Quantity Value Units Method Reference Comment
Δr376.73 ± 0.15kcal/molH-TSNeumark, Lykke, et al., 1985gas phase; Given: 1.461122(3) eV; revised to 1.4611107(17) eV, 95BLO, based on missing term+86CODATA; B

References

Cox, Wagman, et al., 1984
Cox, J.D.; Wagman, D.D.; Medvedev, V.A.,
CODATA Key Values for Thermodynamics, Hemisphere Publishing Corp., New York, 1984, 1. [all data]
Smith, Kim, et al., 1997
Smith, J.R.; Kim, J.B.; Lineberger, W.C.,
High-resolution Threshold Photodetachment Spectroscopy of OH-,
Phys. Rev. A, 1997, 55, 3, 2036, https://doi.org/10.1103/PhysRevA.55.2036
. [all data]
Schulz, Mead, et al., 1982
Schulz, P.A.; Mead, R.D.; Jones, P.L.; Lineberger, W.C.,
OH- and OD- threshold photodetachment,
J. Chem. Phys., 1982, 77, 1153. [all data]
Ervin, Anusiewicz, et al., 2003
Ervin, K.M.; Anusiewicz, W.; Skurski, P.; Simons, J.; Lineberger, W.C.,
The only stable state of O-2(-) is the X (2)Pi(g) ground state and it (still!) has an adiabatic electron detachment energy of,
J. Phys. Chem. A, 2003, 107, 41, 8521-8529, https://doi.org/10.1021/jp0357323
. [all data]
Travers, Cowles, et al., 1989
Travers, M.J.; Cowles, D.C.; Ellison, G.B.,
Reinvestigation of the Electron Affinities of O2 and NO,
Chem. Phys. Lett., 1989, 164, 5, 449, https://doi.org/10.1016/0009-2614(89)85237-6
. [all data]