Tetracyclo[6.2.1.0(2,7).o(3,5)]undecane
- Formula: C11H16
- Molecular weight: 148.2447
- IUPAC Standard InChIKey: VBMPZIREYOVDPP-UHFFFAOYSA-N
- CAS Registry Number: 1777-44-2
- Chemical structure:
View 3d structure (requires JavaScript / HTML 5) - Permanent link for this species. Use this link for bookmarking this species for future reference.

Gas phase thermochemistry data

Data compiled by: Hussein Y. Afeefy, Joel F. Liebman, and Stephen E. Stein
Quantity | Value | Units | Method | Reference | Comment |
---|---|---|---|---|---|
ΔfH°gas | 59.0 ± 3.6 | kJ/mol | Ccb | Luk'yanova, Timofeeva, et al., 1991 |

Condensed phase thermochemistry data

Data compiled by: Hussein Y. Afeefy, Joel F. Liebman, and Stephen E. Stein
Quantity | Value | Units | Method | Reference | Comment |
---|---|---|---|---|---|
ΔfH°liquid | 3.8 ± 3.6 | kJ/mol | Ccb | Luk'yanova, Timofeeva, et al., 1991 | |
Quantity | Value | Units | Method | Reference | Comment |
ΔcH°liquid | -6619.1 ± 3.6 | kJ/mol | Ccb | Luk'yanova, Timofeeva, et al., 1991 | Corresponding ΔfHºliquid = 3.9 kJ/mol (simple calculation by NIST; no Washburn corrections) |

Phase change data

Data compiled as indicated in comments:
AC - William E. Acree, Jr., James S. Chickos
ALS - Hussein Y. Afeefy, Joel F. Liebman, and Stephen E. Stein
DRB - Donald R. Burgess, Jr.
Quantity | Value | Units | Method | Reference | Comment |
---|---|---|---|---|---|
ΔvapH° | 55.3 ± 0.3 | kJ/mol | C | Varushchenko, Pashchenko, et al., 1996 | AC |
ΔvapH° | 55.2 ± 0.5 | kJ/mol | C | Luk'yanova, Timofeeva, et al., 1991 | ALS |
ΔvapH° | 55.2 | kJ/mol | N/A | Luk'yanova, Timofeeva, et al., 1991 | DRB |

References

Luk'yanova, Timofeeva, et al., 1991
Luk'yanova, V.A.; Timofeeva, L.P.; Kozina, M.P.; Kazimirchik, I.V.; Kotel'nikova, T.A.,
Enthalpies of formation of certain polycyclic hydrocarbons,
Russ. J. Phys. Chem. (Engl. Transl.), 1991, 65, 436-439. [all data]
Varushchenko, Pashchenko, et al., 1996
Varushchenko, R.M.; Pashchenko, L.L.; Druzhinina, A.I.,
Enthalpies of vaporization of some mono- and polycyclic hydrocarbons,
Zh. Fiz. Khim., 1996, 70, 2, 228. [all data]