Butane, 2,2-dichloro-3-methyl-
- Formula: C5H10Cl2
- Molecular weight: 141.039
- IUPAC Standard InChIKey: WIQMOFSSJHPXIK-UHFFFAOYSA-N
- CAS Registry Number: 17773-66-9
- Chemical structure:
View 3d structure (requires JavaScript / HTML 5) - Other names: 2,2-Dichloro-3-methylbutane

Normal alkane RI, non-polar column, isothermal

Column type | Active phase | Temperature (C) | I | Reference | Comment |
---|---|---|---|---|---|
Capillary | Squalane | 50. | 790. | Tourres, 1968 | Nitrogen; Column length: 50. m; Column diameter: 0.25 mm |
Capillary | Squalane | 70. | 796. | Tourres, 1968 | Nitrogen; Column length: 50. m; Column diameter: 0.25 mm |

References

Tourres, 1968
Tourres, D.A.,
Separation of mono- and dichloro-methyl butanes and of monochloro-methyl butenes by preparative gas chromatography,
Chromatographia, 1968, 1, 11-12, 437-442, https://doi.org/10.1007/BF02255759
. [all data]