Borane, tris(1-methylethyl)-
- Formula: C9H21B
- Molecular weight: 140.074
- IUPAC Standard InChIKey: ZTKBVWUYLHTIBB-UHFFFAOYSA-N
- CAS Registry Number: 1776-66-5
- Chemical structure:
View 3d structure (requires JavaScript / HTML 5) - Other names: Triisopropylborane

Phase change data

Data compiled by: William E. Acree, Jr., James S. Chickos
Enthalpy of vaporization
ΔvapH (kJ/mol) | Temperature (K) | Method | Reference |
---|---|---|---|
40.0 | 273. to 393. | BG | Bamford, Levi, et al., 1946 |

Reaction thermochemistry data

Data compiled by: John E. Bartmess
Individual Reactions
By formula: F- + C9H21B = (F- • C9H21B)
Quantity | Value | Units | Method | Reference | Comment |
---|---|---|---|---|---|
ΔrH° | 272.0 | kJ/mol | IMRB | Murphy and Beauchamp, 1977 | gas phase; Fluoride Affinity: iPr2BF > iPr3B > Et2BF > Et3B |

Ion clustering data

Data compiled by: John E. Bartmess
Clustering reactions
By formula: F- + C9H21B = (F- • C9H21B)
Quantity | Value | Units | Method | Reference | Comment |
---|---|---|---|---|---|
ΔrH° | 272.0 | kJ/mol | IMRB | Murphy and Beauchamp, 1977 | gas phase; Fluoride Affinity: iPr2BF > iPr3B > Et2BF > Et3B |

References

Bamford, Levi, et al., 1946
Bamford, C.H.; Levi, D.L.; Newitt, D.M.,
91. Physical and chemical properties of organo-metallic compounds. Part I. The vapour pressures and freezing points of simple metal alkyls of Groups II, III, and V,
J. Chem. Soc., 1946, 468, https://doi.org/10.1039/jr9460000468
. [all data]
Murphy and Beauchamp, 1977
Murphy, M.K.; Beauchamp, J.L.,
Fluorine and Alkyl Substituent Effects on Gas-Phase Lewis Acidities of Boranes by ICR Spectroscopy,
Inorg. Chem., 1977, 16, 2437. [all data]