Benzenecarboximidic acid, N-methyl-, methyl ester
- Formula: C9H11NO
- Molecular weight: 149.1897
- IUPAC Standard InChIKey: ODCHIEXXFGKZNZ-KTKRTIGZSA-N
- CAS Registry Number: 1775-61-7
- Chemical structure:

Reaction thermochemistry data

Data compiled by: Hussein Y. Afeefy, Joel F. Liebman, and Stephen E. Stein
Individual Reactions
By formula: C9H11NO = C9H11NO
Quantity | Value | Units | Method | Reference | Comment |
---|---|---|---|---|---|
ΔrH° | 16.6 ± 1.2 | kcal/mol | Eqk | Beak, Lee, et al., 1978 | liquid phase |

References

Beak, Lee, et al., 1978
Beak, P.; Lee, J.-K.; Zeigler, J.M.,
Equilibration studies: amide-imidate and thioamide-thioimidate functions,
J. Org. Chem., 1978, 43, 1536-1538. [all data]