1,4-Dioxaspiro[4.5]decane
- Formula: C8H14O2
- Molecular weight: 142.1956
- IUPAC Standard InChIKey: GZGPRZYZKBQPBQ-UHFFFAOYSA-N
- CAS Registry Number: 177-10-6
- Chemical structure:
View 3d structure (requires JavaScript / HTML 5) - Other names: Cyclohexanone ethylene acetal; Cyclohexanone ethylene ketal; Spiro[cyclohexane-1,2'-[1,3]dioxolane]; 2,2-Pentamethylene-1,3-dioxolane; (Ethylenedioxy)cyclohexane; Cyclohexanone ethlyene ketal

Phase change data

Data compiled as indicated in comments:
BS - Robert L. Brown and Stephen E. Stein
AC - William E. Acree, Jr., James S. Chickos
Quantity | Value | Units | Method | Reference | Comment |
---|---|---|---|---|---|
ΔvapH° | 50.6 ± 0.6 | kJ/mol | GS | Verevkin, Peng, et al., 1998 | Based on data from 278. to 308. K. See also Verevkin, 2002.; AC |
Reduced pressure boiling point
Tboil (K) | Pressure (bar) | Reference | Comment |
---|---|---|---|
346.2 | 0.021 | Aldrich Chemical Company Inc., 1990 | BS |

Gas phase ion energetics data

Data compiled by: Sharon G. Lias, John E. Bartmess, Joel F. Liebman, John L. Holmes, Rhoda D. Levin, and W. Gary Mallard
Ionization energy determinations
IE (eV) | Method | Reference | Comment |
---|---|---|---|
8.8 | PE | Lambert, Xue, et al., 1986 | |
9.30 | PE | Lambert, Xue, et al., 1986 | Vertical value |

References

Verevkin, Peng, et al., 1998
Verevkin, S.P.; Peng, W.-H.; Beckhaus, H.D.; Rücuardt, C.,
Geminal substituent effects. 16. Does the anomeric effect in ketals depend on the hybridization of the central carbon atom?,
Eur. J. Org. Chem., 1998, 11, 2323. [all data]
Verevkin, 2002
Verevkin, Sergey P.,
Improved Benson Increments for the Estimation of Standard Enthalpies of Formation and Enthalpies of Vaporization of Alkyl Ethers, Acetals, Ketals, and Ortho Esters,
J. Chem. Eng. Data, 2002, 47, 5, 1071-1097, https://doi.org/10.1021/je020023o
. [all data]
Aldrich Chemical Company Inc., 1990
Aldrich Chemical Company Inc.,
Catalog Handbook of Fine Chemicals, Aldrich Chemical Company, Inc., Milwaukee WI, 1990, 1. [all data]