Bicyclo[3.1.0]hexan-2-ol, 2-methyl-5-(1-methylethyl)-, (1α,2α,5α)-
- Formula: C10H18O
- Molecular weight: 154.2493
- IUPAC Standard InChIKey: KXSDPILWMGFJMM-UHFFFAOYSA-N
- CAS Registry Number: 17699-16-0
- Chemical structure:
View 3d structure (requires JavaScript / HTML 5) - Species with the same structure:
- Stereoisomers:
- Other names: (1R,2R,5S)-5-Isopropyl-2-methylbicyclo[3.1.0]hexan-2-ol; trans-Sabinene hydrate (trans for Me vs IP); trans-Sabinene hydrate; trans-Sabinene hydroxide; Sabinene hydrate, trans; 5-Isopropyl-2-methylbicyclo[3.1.0]hexan-2-ol, (1α,2α,5α)-; (1α,2α,5α)-2-Methyl-5-(1-methylethyl)bicyclo(3.1.0)hexan-2-ol; trans-4-Thujanol; cis-Sabinene hydrate (cis for OH vs IP); 15826-83-2; cis-Sabinene hydrate; trans-Sabinenhydrate; Sabinene hydrate-cis; cis-Sabinene hydroxide

Kovats' RI, non-polar column, isothermal

Column type | Active phase | Temperature (C) | I | Reference | Comment |
---|---|---|---|---|---|
Capillary | DB-1 | 120. | 1093.92 | Harangi, 2003 | 30. m/0.32 mm/5. μm, He |
Capillary | DB-1 | 120. | 1094.10 | Harangi, 2003 | 30. m/0.32 mm/5. μm, He |
Capillary | DB-1 | 140. | 1101.86 | Harangi, 2003 | 30. m/0.32 mm/5. μm, He |
Capillary | DB-1 | 140. | 1102.39 | Harangi, 2003 | 30. m/0.32 mm/5. μm, He |
Capillary | DB-1 | 120. | 1064.92 | Harangi, 2003 | 30. m/0.32 mm/5. μm, He |
Capillary | DB-1 | 140. | 1072.66 | Harangi, 2003 | 30. m/0.32 mm/5. μm, He |
Capillary | OV-1 | 100. | 1086.63 | Tarján, Bitter, et al., 2002 | 25. m/0.2 mm/0.5 μm, He |
Capillary | OV-1 | 110. | 1090.26 | Tarján, Bitter, et al., 2002 | 25. m/0.2 mm/0.5 μm, He |
Capillary | OV-1 | 120. | 1094.00 | Tarján, Bitter, et al., 2002 | 25. m/0.2 mm/0.5 μm, He |
Capillary | OV-1 | 130. | 1097.88 | Tarján, Bitter, et al., 2002 | 25. m/0.2 mm/0.5 μm, He |
Capillary | OV-1 | 140. | 1101.89 | Tarján, Bitter, et al., 2002 | 25. m/0.2 mm/0.5 μm, He |
Capillary | OV-1 | 150. | 1106.04 | Tarján, Bitter, et al., 2002 | 25. m/0.2 mm/0.5 μm, He |
Capillary | OV-1 | 80. | 1079.72 | Tarján, Bitter, et al., 2002 | 25. m/0.2 mm/0.5 μm, He |
Capillary | OV-1 | 90. | 1083.12 | Tarján, Bitter, et al., 2002 | 25. m/0.2 mm/0.5 μm, He |
Capillary | OV-1 | 100. | 1058.13 | Tarján, Bitter, et al., 2002 | 25. m/0.2 mm/0.5 μm, He |
Capillary | OV-1 | 110. | 1061.31 | Tarján, Bitter, et al., 2002 | 25. m/0.2 mm/0.5 μm, He |
Capillary | OV-1 | 120. | 1064.72 | Tarján, Bitter, et al., 2002 | 25. m/0.2 mm/0.5 μm, He |
Capillary | OV-1 | 130. | 1068.31 | Tarján, Bitter, et al., 2002 | 25. m/0.2 mm/0.5 μm, He |
Capillary | OV-1 | 140. | 1072.09 | Tarján, Bitter, et al., 2002 | 25. m/0.2 mm/0.5 μm, He |
Capillary | OV-1 | 150. | 1076.07 | Tarján, Bitter, et al., 2002 | 25. m/0.2 mm/0.5 μm, He |
Capillary | OV-1 | 80. | 1052.01 | Tarján, Bitter, et al., 2002 | 25. m/0.2 mm/0.5 μm, He |
Capillary | OV-1 | 90. | 1054.96 | Tarján, Bitter, et al., 2002 | 25. m/0.2 mm/0.5 μm, He |

Kovats' RI, non-polar column, temperature ramp

Column type | Active phase | I | Reference | Comment |
---|---|---|---|---|
Capillary | DB-5 | 1068. | Adams, González Elizondo, et al., 2006 | 30. m/0.26 mm/0.25 μm, He, 3. K/min; Tstart: 60. C; Tend: 246. C |
Capillary | DB-5 | 1097. | Adams, González Elizondo, et al., 2006 | 30. m/0.26 mm/0.25 μm, He, 3. K/min; Tstart: 60. C; Tend: 246. C |
Capillary | HP-5MS | 1075. | Hazzit, Baaliouamer, et al., 2006 | 30. m/0.25 mm/0.25 μm, He, 60. C @ 8. min, 2. K/min, 280. C @ 30. min |
Capillary | HP-5MS | 1101. | Hazzit, Baaliouamer, et al., 2006 | 30. m/0.25 mm/0.25 μm, He, 60. C @ 8. min, 2. K/min, 280. C @ 30. min |
Capillary | DB-5 | 1070. | Lucero, Fredrickson, et al., 2006 | 30. m/0.25 mm/0.25 μm, He, 3. K/min; Tstart: 60. C |
Capillary | BP-1 | 1096. | Raina, Verma, et al., 2006 | 25. m/0.32 mm/0.25 μm, N2, 5. K/min, 220. C @ 13. min; Tstart: 60. C |
Capillary | BP-1 | 1070. | Raina, Verma, et al., 2006 | 25. m/0.32 mm/0.25 μm, N2, 5. K/min, 220. C @ 13. min; Tstart: 60. C |
Capillary | DB-5 | 1070. | Adams, Morris, et al., 2005 | 30. m/0.26 mm/0.25 μm, He, 3. K/min; Tstart: 60. C; Tend: 246. C |
Capillary | DB-5 | 1068. | Adams and Nguyen, 2005 | 30. m/0.26 mm/0.25 μm, He, 3. K/min; Tstart: 60. C; Tend: 246. C |
Capillary | DB-5 | 1097. | Adams and Nguyen, 2005 | 30. m/0.26 mm/0.25 μm, He, 3. K/min; Tstart: 60. C; Tend: 246. C |
Capillary | HP-5MS | 1071. | Asuming, Beauchamp, et al., 2005 | 30. m/0.25 mm/0.25 μm, He, 50. C @ 10. min, 3. K/min, 250. C @ 5. min |
Capillary | HP-5MS | 1097. | Asuming, Beauchamp, et al., 2005 | 30. m/0.25 mm/0.25 μm, He, 50. C @ 10. min, 3. K/min, 250. C @ 5. min |
Capillary | BP-5 | 1099. | Baranauskiene, Venskutonis, et al., 2005 | 50. m/0.32 mm/0.25 μm, He, 50. C @ 2. min, 5. K/min, 260. C @ 5. min |
Capillary | BP-5 | 1070. | Baranauskiene, Venskutonis, et al., 2005 | 50. m/0.32 mm/0.25 μm, He, 50. C @ 2. min, 5. K/min, 260. C @ 5. min |
Capillary | DB-5 | 1069. | Medina, Lucero, et al., 2005 | 30. m/0.25 mm/0.25 μm, Helium, 3. K/min; Tstart: 60. C; Tend: 255. C |
Capillary | HP-5MS | 1043. | Tepe, Sokmen, et al., 2005 | 30. m/0.25 mm/0.25 μm, He, 3. K/min; Tstart: 50. C; Tend: 240. C |
Capillary | DB-5 | 1069. | Avato, Raffo, et al., 2004 | 30. m/0.25 mm/0.25 μm, H2, 4. K/min, 280. C @ 30. min; Tstart: 40. C |
Capillary | DB-5 | 1107. | Avato, Raffo, et al., 2004 | 30. m/0.25 mm/0.25 μm, H2, 4. K/min, 280. C @ 30. min; Tstart: 40. C |
Capillary | BPX-5 | 1093. | El-Ghorab, Mansour, et al., 2004 | 25. m/0.22 mm/0.25 μm, He, 3. K/min; Tstart: 60. C; Tend: 240. C |
Capillary | HP-5 | 1070. | Lopes, Strobl, et al., 2004 | 30. m/0.25 mm/0.25 μm, He, 3. K/min; Tstart: 60. C; Tend: 260. C |
Capillary | HP-5 | 1099. | Lopes, Strobl, et al., 2004 | 30. m/0.25 mm/0.25 μm, He, 3. K/min; Tstart: 60. C; Tend: 260. C |
Capillary | HP-5 | 1076. | Bouzouita, Kachouri, et al., 2003 | 30. m/0.25 mm/1. μm, He, 40. C @ 1. min, 5. K/min; Tend: 250. C |
Capillary | HP-5MS | 1045. | Gkinis, Tzakou, et al., 2003 | 30. m/0.25 mm/0.25 μm, He, 3. K/min; Tstart: 60. C; Tend: 280. C |
Capillary | HP-5 | 1058. | Özcan, Tzakou, et al., 2003 | 30. m/0.25 mm/0.25 μm, He, 3. K/min; Tstart: 60. C; Tend: 280. C |
Capillary | HP-5 | 1093. | Özcan, Tzakou, et al., 2003 | 30. m/0.25 mm/0.25 μm, He, 3. K/min; Tstart: 60. C; Tend: 280. C |
Capillary | SE-30 | 1083. | Palá-Paúl, Velasco-Negueruela, et al., 2002 | 25. m/0.22 mm/0.25 μm, He, 4. K/min; Tstart: 70. C; Tend: 220. C |
Capillary | SE-30 | 1056. | Palá-Paúl, Velasco-Negueruela, et al., 2002 | 25. m/0.22 mm/0.25 μm, He, 4. K/min; Tstart: 70. C; Tend: 220. C |
Capillary | BP-1 | 1094. | Raina, Lal, et al., 2002 | 60. m/0.32 mm/0.25 μm, N2, 5. K/min; Tstart: 60. C; Tend: 220. C |
Capillary | BP-1 | 1061. | Raina, Lal, et al., 2002 | 60. m/0.32 mm/0.25 μm, N2, 5. K/min; Tstart: 60. C; Tend: 220. C |
Capillary | BP-1 | 1091. | Raina, Srivastava, et al., 2002 | 25. m/0.32 mm/0.25 μm, N2, 5. K/min, 220. C @ 15. min; Tstart: 60. C |
Capillary | BP-1 | 1062. | Raina, Srivastava, et al., 2002 | 25. m/0.32 mm/0.25 μm, N2, 5. K/min, 220. C @ 15. min; Tstart: 60. C |
Capillary | BP-1 | 1060. | Rajeswara Rao, 2002 | 25. m/0.5 mm/0.25 μm, N2, 5. K/min, 220. C @ 10. min; Tstart: 60. C |
Capillary | BP-1 | 1060. | Rao B.R.R., 2002 | 25. m/0.5 mm/0.25 μm, 5. K/min, 220. C @ 10. min; Tstart: 60. C |
Capillary | BP-1 | 1086. | Shawl, Srivastava, et al., 2002 | 30. m/0.32 mm/0.25 μm, N2, 5. K/min, 220. C @ 13. min; Tstart: 60. C |
Capillary | BP-1 | 1051. | Shawl, Srivastava, et al., 2002 | 30. m/0.32 mm/0.25 μm, N2, 5. K/min, 220. C @ 13. min; Tstart: 60. C |
Capillary | HP-5 | 1068. | Kitic, Palic, et al., 2001 | 25. m/0.32 mm/0.52 μm, H2, 4. K/min; Tstart: 40. C; Tend: 240. C |
Capillary | HP-5 | 1097. | Kitic, Palic, et al., 2001 | 25. m/0.32 mm/0.52 μm, H2, 4. K/min; Tstart: 40. C; Tend: 240. C |
Capillary | DB-1 | 1073. | Palá-Paúl, Velasco-Negueruela, et al., 2001 | 50. m/0.25 mm/0.25 μm, N2, 4. K/min; Tstart: 80. C; Tend: 225. C |
Capillary | HP-5 | 1067. | Tzakou and Couladis, 2001 | 30. m/0.25 mm/0.25 μm, He, 3. K/min; Tstart: 60. C; Tend: 280. C |
Capillary | SE-54 | 1068. | Adams, 2000 | 30. m/0.26 mm/0.25 μm, He, 3. K/min; Tstart: 60. C; Tend: 246. C |
Capillary | SE-54 | 1097. | Adams, 2000 | 30. m/0.26 mm/0.25 μm, He, 3. K/min; Tstart: 60. C; Tend: 246. C |
Capillary | DB-5 | 1068. | Adams, 2000, 2 | 30. m/0.26 mm/0.25 μm, He, 3. K/min; Tstart: 60. C; Tend: 240. C |
Capillary | DB-5 | 1097. | Adams, 2000, 2 | 30. m/0.26 mm/0.25 μm, He, 3. K/min; Tstart: 60. C; Tend: 240. C |
Capillary | SE-54 | 1068. | Adams, 2000, 3 | 30. m/0.26 mm/0.25 μm, 3. K/min; Tstart: 60. C; Tend: 246. C |
Capillary | SE-54 | 1097. | Adams, 2000, 3 | 30. m/0.26 mm/0.25 μm, 3. K/min; Tstart: 60. C; Tend: 246. C |
Capillary | DB-5 | 1068. | Adams, 2000, 4 | 30. m/0.26 mm/0.25 μm, He, 3. K/min; Tstart: 60. C; Tend: 246. C |
Capillary | DB-5 | 1097. | Adams, 2000, 4 | 30. m/0.26 mm/0.25 μm, He, 3. K/min; Tstart: 60. C; Tend: 246. C |
Capillary | SE-30 | 1052. | Kardali, Velasco-Negueruela, et al., 2000 | 25. m/0.22 mm/0.25 μm, He, 5. K/min; Tstart: 70. C; Tend: 220. C |
Capillary | DB-5 | 1068. | Adams, 1999 | 30. m/0.26 mm/0.25 μm, He, 3. K/min; Tstart: 60. C; Tend: 246. C |
Capillary | DB-5 | 1097. | Adams, 1999 | 30. m/0.26 mm/0.25 μm, He, 3. K/min; Tstart: 60. C; Tend: 246. C |
Capillary | CP Sil 5 CB | 1059. | Kaul, Gujral, et al., 1999 | He, 5. K/min; Column length: 25. m; Column diameter: 0.25 mm; Tstart: 60. C; Tend: 280. C |
Capillary | HP-5 | 1065. | Sajjadi and Ghassemi, 1999 | 30. m/0.25 mm/0.25 μm, He, 4. K/min; Tstart: 60. C; Tend: 280. C |
Capillary | DB-5 | 1116. | Senatore and de Feo, 1999 | 30. m/0.25 mm/0.33 μm, He, 40. C @ 5. min, 2. K/min, 260. C @ 20. min |
Capillary | DB-5 | 1064. | da Silva, Andrade, et al., 1999 | 30. m/0.25 mm/0.25 μm, He, 3. K/min; Tstart: 60. C; Tend: 240. C |
Capillary | BP-1 | 1091. | Vera and Chane-Ming, 1999 | 50. m/0.25 mm/0.25 μm, 2. K/min; Tstart: 60. C; Tend: 260. C |
Capillary | BP-1 | 1092. | Vera and Chane-Ming, 1999 | 50. m/0.25 mm/0.25 μm, 2. K/min; Tstart: 60. C; Tend: 260. C |
Capillary | BP-1 | 1078. | Vera and Chane-Ming, 1999 | 50. m/0.25 mm/0.25 μm, 2. K/min; Tstart: 60. C; Tend: 260. C |
Capillary | BP-1 | 1085. | Vera and Chane-Ming, 1999 | 50. m/0.25 mm/0.25 μm, 2. K/min; Tstart: 60. C; Tend: 260. C |
Capillary | Methyl Silicone | 1065. | Adegoke, Rao, et al., 1998 | 30. m/0.32 mm/0.25 μm, He, 60. C @ 2. min, 2. K/min, 250. C @ 5. min |
Capillary | Methyl Silicone | 1096. | Adegoke, Rao, et al., 1998 | 30. m/0.32 mm/0.25 μm, He, 60. C @ 2. min, 2. K/min, 250. C @ 5. min |
Capillary | BP-1 | 1090. | Breheret, Talou, et al., 1997 | 50. m/0.22 mm/1. μm, He, 3. K/min; Tstart: 50. C; Tend: 220. C |
Capillary | BP-1 | 1060. | Breheret, Talou, et al., 1997 | 50. m/0.22 mm/1. μm, He, 3. K/min; Tstart: 50. C; Tend: 220. C |
Capillary | DB-5 | 1069. | Tellez, Estell, et al., 1997 | 30. m/0.25 mm/0.25 μm, He, 3. K/min; Tstart: 60. C; Tend: 240. C |
Capillary | DB-5 | 1096. | Tellez, Estell, et al., 1997 | 30. m/0.25 mm/0.25 μm, He, 3. K/min; Tstart: 60. C; Tend: 240. C |
Capillary | OV-101 | 1064. | Padrayuttawat, Tamura, et al., 1996 | 50. m/0.25 mm/0.2 μm, N2, 2. K/min, 200. C @ 60. min; Tstart: 80. C |
Capillary | SPB-1 | 1073. | Wong and Tie, 1993 | He, 35. C @ 5. min, 3. K/min, 200. C @ 20. min; Column length: 50. m; Column diameter: 0.20 mm |

Kovats' RI, non-polar column, custom temperature program

Column type | Active phase | I | Reference | Comment |
---|---|---|---|---|
Capillary | DB-5MS | 1070. | Tuberoso, Kowalczyk, et al., 2005 | 30. m/0.25 mm/0.25 μm, He; Program: 60C(5min) => 2C/min => 140C= 5C/min => 250C(5min) |
Capillary | BP-1 | 1092. | Dwivedi, Khan, et al., 2004 | 25. m/0.25 mm/0.25 μm, N2; Program: 60C => 5C/min => 220C(5min) => 3C/min => 245C(5min) |
Capillary | BP-1 | 1055. | Dwivedi, Khan, et al., 2004 | 25. m/0.25 mm/0.25 μm, N2; Program: 60C => 5C/min => 220C(5min) => 3C/min => 245C(5min) |
Capillary | BP-1 | 1091. | Khan, Srivastava, et al., 2003 | 25. m/0.25 mm/0.25 μm, N2; Program: 60C => 5C/min => 220C (5min) => 3C/min => 245 C (5min) |
Capillary | OV-1 | 1052. | El-Shazly, Dorai, et al., 2002 | 30. m/0.25 mm/0.25 μm, He; Program: 44C(4min) => 3C/min => 74C => 6C/min => 134C => 12C/min => 312C |
Capillary | HP-5 | 1064. | Frizzo, Serafini, et al., 2001 | 30. m/0.32 mm/0.25 μm, H2; Program: 60 0C (8 min) 3 K/min -> 180 0C 20 K/min (20 min) |
Capillary | DB-5 | 1068. | Adams, 1998 | 30. m/0.26 mm/0.25 μm; Program: not specified |
Capillary | DB-5 | 1072. | Santos, Andrade, et al., 1998 | 30. m/0.25 mm/0.25 μm, He; Program: 40C => 2C/min => 60C => 4C/min => 240C |

Kovats' RI, polar column, temperature ramp

Column type | Active phase | I | Reference | Comment |
---|---|---|---|---|
Capillary | Stabilwax | 1482. | Hazzit, Baaliouamer, et al., 2006 | 30. m/0.32 mm/1. μm, N2, 50. C @ 3. min, 2. K/min, 220. C @ 15. min |
Capillary | DB-Wax | 1450. | Avato, Raffo, et al., 2004 | 30. m/0.25 mm/0.25 μm, H2, 40. C @ 2. min, 4. K/min, 260. C @ 15. min |
Capillary | DB-Wax | 1467. | Lopes, Strobl, et al., 2004 | 30. m/0.32 mm/0.25 μm, He, 40. C @ 5. min, 3. K/min; Tend: 220. C |
Capillary | Supelcowax-10 | 1450. | Tzakou and Couladis, 2001 | 30. m/0.32 mm/0.25 μm, He, 3. K/min; Tstart: 75. C; Tend: 230. C |
Capillary | Carbowax 20M | 1464. | Vera and Chane-Ming, 1999 | 50. m/0.32 mm/0.2 μm, 2. K/min; Tstart: 60. C; Tend: 260. C |
Capillary | Carbowax 20M | 1464. | Vera and Chane-Ming, 1999 | 50. m/0.32 mm/0.2 μm, 2. K/min; Tstart: 60. C; Tend: 260. C |
Capillary | Supelcowax-10 | 1480. | Wong and Tie, 1993 | He, 35. C @ 5. min, 3. K/min, 200. C @ 20. min; Column length: 60. m; Column diameter: 0.25 mm |

Van Den Dool and Kratz RI, non-polar column, temperature ramp

Column type | Active phase | I | Reference | Comment |
---|---|---|---|---|
Capillary | RTX-1 | 1051. | Bendahou, Muselli, et al., 2008 | 60. m/0.22 mm/0.25 μm, He, 2. K/min, 230. C @ 30. min; Tstart: 60. C |
Capillary | Equity-5MS | 1070. | Belsito E.L., Carbone C., et al., 2007 | 30. m/0.25 mm/0.25 μm, He, 3. K/min, 250. C @ 10. min; Tstart: 50. C |
Capillary | HP-5MS | 1063. | Benkaci-Ali, Baaliouamer, et al., 2007 | 30. m/0.25 mm/0.25 μm, He, 60. C @ 8. min, 2. K/min, 250. C @ 30. min |
Capillary | HP-5MS | 1095. | Benkaci-Ali, Baaliouamer, et al., 2007 | 30. m/0.25 mm/0.25 μm, He, 60. C @ 8. min, 2. K/min, 250. C @ 30. min |
Capillary | HP-5 | 1066. | Dehghan, Solaimanian, et al., 2007 | 25. m/0.25 mm/0.25 μm, He, 60. C @ 2. min, 4. K/min; Tend: 240. C |
Capillary | DB-5 | 1070. | Flamini, Cioni, et al., 2007 | 30. m/0.25 mm/0.25 μm, He, 3. K/min; Tstart: 60. C; Tend: 240. C |
Capillary | DB-5 | 1102. | Flamini, Cioni, et al., 2007 | 30. m/0.25 mm/0.25 μm, He, 3. K/min; Tstart: 60. C; Tend: 240. C |
Capillary | HP-5 | 1070. | Flamini, Tebano, et al., 2007 | 30. m/0.25 mm/0.25 μm, N2, 50. C @ 10. min, 5. K/min; Tend: 220. C |
Capillary | HP-5 | 1103. | Flamini, Tebano, et al., 2007 | 30. m/0.25 mm/0.25 μm, N2, 50. C @ 10. min, 5. K/min; Tend: 220. C |
Capillary | HP-5 | 1070. | Flamini, Tebano, et al., 2007, 2 | 30. m/0.25 mm/0.25 μm, N2, 60. C @ 10. min, 5. K/min; Tend: 220. C |
Capillary | HP-5 | 1100. | Flamini, Tebano, et al., 2007, 2 | 30. m/0.25 mm/0.25 μm, N2, 60. C @ 10. min, 5. K/min; Tend: 220. C |
Capillary | BP-1 | 1050. | Lesueur, de Rocca Serra, et al., 2007 | 50. m/0.22 mm/0.25 μm, He, 2. K/min, 220. C @ 20. min; Tstart: 60. C |
Capillary | BP-1 | 1081. | Lesueur, de Rocca Serra, et al., 2007 | 50. m/0.22 mm/0.25 μm, He, 2. K/min, 220. C @ 20. min; Tstart: 60. C |
Capillary | DB-5 | 1070. | Maccioni, Baldini, et al., 2007 | 30. m/0.25 mm/0.25 μm, He, 3. K/min; Tstart: 60. C; Tend: 240. C |
Capillary | DB-5 | 1070. | Sabulal, Dan, et al., 2007 | 30. m/0.25 mm/0.25 μm, He, 5. K/min; Tstart: 60. C; Tend: 260. C |
Capillary | HP-5MS | 1064. | Saroglou, Marin, et al., 2007 | 30. m/0.25 mm/0.25 μm, He, 60. C @ 5. min, 4. K/min; Tend: 280. C |
Capillary | SPB-1 | 1087. | Blagojevic, Radulovic, et al., 2006 | 30. m/0.25 mm/0.25 μm, He, 50. C @ 3. min, 5. K/min, 250. C @ 15. min |
Capillary | DB-5 | 1069. | Blagojevic, Radulovic, et al., 2006 | 30. m/0.2 mm/0.25 μm, He, 50. C @ 3. min, 5. K/min, 250. C @ 15. min |
Capillary | DB-5 | 1075. | Block, Flamini, et al., 2006 | 30. m/0.25 mm/0.25 μm, He, 3. K/min; Tstart: 60. C; Tend: 240. C |
Capillary | HP-5MS | 1068. | Chorianopoulos N., Evergets E., et al., 2006 | 30. m/0.25 mm/0.25 μm, He, 3. K/min; Tstart: 60. C; Tend: 280. C |
Capillary | DB-5 | 1068. | Esmaeili, Nematollahi, et al., 2006 | 50. m/0.2 mm/0.32 μm, N2, 60. C @ 3. min, 5. K/min, 220. C @ 5. min |
Capillary | DB-5 | 1097. | Esmaeili, Nematollahi, et al., 2006 | 50. m/0.2 mm/0.32 μm, N2, 60. C @ 3. min, 5. K/min, 220. C @ 5. min |
Capillary | HP-5MS | 1047. | Pavlovic, Kovacevic, et al., 2006 | 30. m/0.25 mm/0.25 μm, He, 3. K/min; Tstart: 60. C; Tend: 280. C |
Capillary | SPB-1 | 1080. | Pinto, Pina-Vaz, et al., 2006 | 30. m/0.2 mm/0.2 μm, He, 3. K/min, 220. C @ 15. min; Tstart: 70. C |
Capillary | SPB-1 | 1050. | Pinto, Pina-Vaz, et al., 2006 | 30. m/0.2 mm/0.2 μm, He, 3. K/min, 220. C @ 15. min; Tstart: 70. C |
Capillary | SPB-1 | 1077. | Salgueiro L.R., Pinto E., et al., 2006 | 30. m/0.2 mm/0.2 μm, He, 3. K/min, 220. C @ 15. min; Tstart: 70. C |
Capillary | SPB-1 | 1050. | Salgueiro L.R., Pinto E., et al., 2006 | 30. m/0.2 mm/0.2 μm, He, 3. K/min, 220. C @ 15. min; Tstart: 70. C |
Capillary | HP-5MS | 1061. | Saroglou, Dorizas, et al., 2006 | 30. m/0.25 mm/0.25 μm, He, 60. C @ 5. min, 4. K/min; Tend: 280. C |
Capillary | HP-5MS | 1096. | Saroglou, Dorizas, et al., 2006 | 30. m/0.25 mm/0.25 μm, He, 60. C @ 5. min, 4. K/min; Tend: 280. C |
Capillary | HP-5 | 1070. | Cioni, Flamini, et al., 2005 | 30. m/0.25 mm/0.25 μm, N2, 60. C @ 10. min, 5. K/min; Tend: 220. C |
Capillary | RTX-1 | 1083. | Cozzani, Muselli, et al., 2005 | 60. m/0.22 mm/0.25 μm, 2. K/min, 220. C @ 20. min; Tstart: 60. C |
Capillary | MDN-5 | 1068. | Dugo, Mondello, et al., 2005 | 30. m/0.25 mm/0.25 μm, He, 3. K/min; Tstart: 50. C; Tend: 250. C |
Capillary | DB-1 | 1050. | Fanciullino, Gancel, et al., 2005 | 30. m/0.25 mm/0.25 μm, He, 3. K/min, 250. C @ 20. min; Tstart: 40. C |
Capillary | DB-1 | 1116. | de Feo, Urrunaga Soria, et al., 2005 | 30. m/0.25 mm/0.25 μm, He, 40. C @ 5. min, 2. K/min, 260. C @ 20. min |
Capillary | HP-5 | 1070. | Flamini, Luigi Cioni, et al., 2005 | 30. m/0.25 mm/0.25 μm, N2, 60. C @ 10. min, 5. K/min; Tend: 220. C |
Capillary | DB-1 | 1050. | Gancel, Ollitrault, et al., 2005 | 30. m/0.25 mm/0.25 μm, He, 3. K/min, 250. C @ 20. min; Tstart: 40. C |
Capillary | DB-5 | 1070. | Senatore, Napolitano, et al., 2005 | 30. m/0.25 mm/0.25 μm, He, 40. C @ 5. min, 2. K/min, 260. C @ 20. min |
Capillary | DB-5 | 1064. | Senatore, Napolitano, et al., 2005 | 30. m/0.25 mm/0.25 μm, He, 40. C @ 5. min, 2. K/min, 260. C @ 20. min |
Capillary | Mega 5MS | 1058. | Verzera, Trozzi, et al., 2005 | 30. m/0.25 mm/0.25 μm, He, 40. C @ 2. min, 3. K/min; Tend: 240. C |
Capillary | Mega 5MS | 1088. | Verzera, Trozzi, et al., 2005 | 30. m/0.25 mm/0.25 μm, He, 40. C @ 2. min, 3. K/min; Tend: 240. C |
Capillary | SE-54 | 1067. | Alma, Nitz, et al., 2004 | 30. m/0.25 mm/0.25 μm, He, 60. C @ 5. min, 2. K/min; Tend: 260. C |
Capillary | HP-5 | 1070. | Ceccarini, Macchia, et al., 2004 | 30. m/0.25 mm/0.25 μm, 60. C @ 10. min, 5. K/min; Tend: 220. C |
Capillary | HP-5 | 1099. | Ceccarini, Macchia, et al., 2004 | 30. m/0.25 mm/0.25 μm, 60. C @ 10. min, 5. K/min; Tend: 220. C |
Capillary | HP-5MS | 1068. | Chorianopoulos, Kalpoutzakis, et al., 2004 | 30. m/0.25 mm/0.25 μm, He, 3. K/min; Tstart: 60. C; Tend: 280. C |
Capillary | RTX-5 | 1066. | Dugo, Mondello, et al., 2004 | 30. m/0.25 mm/0.25 μm, He, 45. C @ 6. min, 3. K/min, 300. C @ 10. min |
Capillary | RTX-5 | 1096. | Dugo, Mondello, et al., 2004 | 30. m/0.25 mm/0.25 μm, He, 45. C @ 6. min, 3. K/min, 300. C @ 10. min |
Capillary | HP-5 | 1070. | Flamini, Bader, et al., 2004 | 30. m/0.25 mm/0.25 μm, He, 3. K/min; Tstart: 60. C; Tend: 240. C |
Capillary | BP-1 | 1083. | Gonny, Bradesi, et al., 2004 | 50. m/0.22 mm/0.25 μm, 2. K/min, 220. C @ 20. min; Tstart: 60. C |
Capillary | BP-1 | 1053. | Gonny, Bradesi, et al., 2004 | 50. m/0.22 mm/0.25 μm, 2. K/min, 220. C @ 20. min; Tstart: 60. C |
Capillary | HP-5 | 1066. | Javidnia, Miri, et al., 2004 | 30. m/0.25 mm/0.25 μm, He, 3. K/min; Tstart: 60. C; Tend: 260. C |
Capillary | DB-5 | 1068. | Javidnia, Miri, et al., 2004, 2 | 30. m/0.25 mm/0.25 μm, He, 3. K/min; Tstart: 60. C; Tend: 260. C |
Capillary | HP-5MS | 1067. | Karioti, Hadjipavlou-Litina, et al., 2004 | 30. m/0.25 mm/0.25 μm, He, 60. C @ 5. min, 4. K/min; Tend: 280. C |
Capillary | SPB-1 | 1051. | Moldão-Martins, Beirão-da-Costa, et al., 2004 | 30. m/0.2 mm/0.2 μm, He, 3. K/min, 220. C @ 15. min; Tstart: 70. C |
Capillary | BP-1 | 1064. | Raina, Kumar, et al., 2004 | 30. m/0.32 mm/0.25 μm, N2, 5. K/min, 220. C @ 13. min; Tstart: 60. C |
Capillary | HP-5 | 1068. | Stashenko, Jaramillo, et al., 2004 | 50. m/0.2 mm/0.2 μm, He, 40. C @ 15. min, 3. K/min, 250. C @ 40. min |
Capillary | HP-5 | 1100. | Stashenko, Jaramillo, et al., 2004 | 50. m/0.2 mm/0.2 μm, He, 40. C @ 15. min, 3. K/min, 250. C @ 40. min |
Capillary | DB-5 | 1070. | Bader, Caponi, et al., 2003 | 30. m/0.25 mm/0.25 μm, N2, 60. C @ 10. min, 5. K/min; Tend: 220. C |
Capillary | DB-5 | 1070. | Bader, Flamini, et al., 2003 | 30. m/0.25 mm/0.25 μm, He, 3. K/min; Tstart: 60. C; Tend: 240. C |
Capillary | DB-5 | 1101. | Bader, Flamini, et al., 2003 | 30. m/0.25 mm/0.25 μm, He, 3. K/min; Tstart: 60. C; Tend: 240. C |
Capillary | SPB-1 | 1051. | Cavaleiro, Salgueiro, et al., 2003 | 30. m/0.2 mm/0.2 μm, He, 3. K/min, 220. C @ 15. min; Tstart: 70. C |
Capillary | DB-1 | 1045. | de Feo, Bruno, et al., 2003 | 30. m/0.25 mm/0.25 μm, He, 40. C @ 5. min, 2. K/min, 250. C @ 20. min |
Capillary | DB-1 | 1074. | de Feo, Bruno, et al., 2003 | 30. m/0.25 mm/0.25 μm, He, 40. C @ 5. min, 2. K/min, 250. C @ 20. min |
Capillary | DB-1 | 1116. | de Feo, Urrunaga Soria, et al., 2003 | 30. m/0.25 mm/0.25 μm, He, 40. C @ 5. min, 2. K/min; Tend: 250. C |
Capillary | DB-5 | 1070. | Flamini, Luigi Cioni, et al., 2003 | 30. m/0.25 mm/0.25 μm, He, 3. K/min; Tstart: 60. C; Tend: 240. C |
Capillary | HP-5 | 1070. | Flamini, Luigi Cioni, et al., 2003, 2 | 30. m/0.25 mm/0.25 μm, N2, 60. C @ 10. min, 5. K/min; Tend: 220. C |
Capillary | HP-5 | 1070. | Flamini, Luigi Cioni, et al., 2003, 3 | 30. m/0.25 mm/0.25 μm, N2, 60. C @ 10. min, 5. K/min; Tend: 220. C |
Capillary | HP-5 | 1101. | Flamini, Luigi Cioni, et al., 2003, 3 | 30. m/0.25 mm/0.25 μm, N2, 60. C @ 10. min, 5. K/min; Tend: 220. C |
Capillary | DB-1 | 1050. | Gancel, Ollitrault, et al., 2003 | 30. m/0.25 mm/0.25 μm, He, 3. K/min, 250. C @ 20. min; Tstart: 40. C |
Capillary | DB-5 | 1065. | Jantan, Ling, et al., 2003 | 30. m/0.25 mm/0.25 μm, He, 75. C @ 10. min, 3. K/min, 230. C @ 20. min |
Capillary | HP-5 | 1068. | Karioti, Skaltsa, et al., 2003 | 30. m/0.25 mm/0.25 μm, He, 60. C @ 5. min, 4. K/min; Tend: 280. C |
Capillary | HP-5 | 1097. | Karioti, Skaltsa, et al., 2003 | 30. m/0.25 mm/0.25 μm, He, 60. C @ 5. min, 4. K/min; Tend: 280. C |
Capillary | HP-5 | 1069. | Macchioni, Cioni, et al., 2003 | 30. m/0.25 mm/0.25 μm, He, 3. K/min; Tstart: 60. C; Tend: 240. C |
Capillary | HP-5MS | 1074. | Mimica-Dukic, Kujundzic, et al., 2003 | 30. m/0.25 mm/0.25 μm, He, 3. K/min; Tstart: 60. C; Tend: 280. C |
Capillary | HP-5MS | 1098. | Mimica-Dukic, Kujundzic, et al., 2003 | 30. m/0.25 mm/0.25 μm, He, 3. K/min; Tstart: 60. C; Tend: 280. C |
Capillary | HP-5MS | 1066. | Salido, Altarejos, et al., 2003 | 30. m/0.25 mm/0.25 μm, He, 3. K/min; Tstart: 50. C; Tend: 250. C |
Capillary | HP-5MS | 1097. | Salido, Altarejos, et al., 2003 | 30. m/0.25 mm/0.25 μm, He, 3. K/min; Tstart: 50. C; Tend: 250. C |
Capillary | RTX-5 | 1105. | Shellie, Marriott, et al., 2003 | 30. m/0.25 mm/0.25 μm, He, 45. C @ 6. min, 3. K/min; Tend: 250. C |
Capillary | RTX-5 | 1073. | Shellie, Marriott, et al., 2003 | 30. m/0.25 mm/0.25 μm, He, 45. C @ 6. min, 3. K/min; Tend: 250. C |
Capillary | HP-5 | 1064. | Skaltsa, Demetzos, et al., 2003 | 30. m/0.25 mm/0.25 μm, He, 60. C @ 5. min, 4. K/min; Tend: 280. C |
Capillary | Mega 5MS | 1058. | Verzera, Trozzi, et al., 2003 | 30. m/0.25 mm/0.25 μm, He, 40. C @ 2. min, 3. K/min; Tend: 240. C |
Capillary | DB-5 | 1068. | Economakis, Skaltsa, et al., 2002 | 30. m/0.25 mm/0.25 μm, 50. C @ 5. min, 3. K/min; Tend: 280. C |
Capillary | DB-5 | 1097. | Economakis, Skaltsa, et al., 2002 | 30. m/0.25 mm/0.25 μm, 50. C @ 5. min, 3. K/min; Tend: 280. C |
Capillary | DB-5 | 1070. | Flamini, Cioni, et al., 2002 | 30. m/0.25 mm/0.25 μm, He, 3. K/min; Tstart: 60. C; Tend: 240. C |
Capillary | HP-5 | 1070. | Flamini, Cioni, et al., 2002, 2 | 30. m/0.25 mm/0.25 μm, N2, 60. C @ 10. min, 5. K/min; Tend: 220. C |
Capillary | HP-5 | 1102. | Flamini, Cioni, et al., 2002, 2 | 30. m/0.25 mm/0.25 μm, N2, 60. C @ 10. min, 5. K/min; Tend: 220. C |
Capillary | BP-1 | 1053. | Lota, de Rocca Serra, et al., 2002 | 50. m/0.22 mm/0.25 μm, He, 2. K/min, 220. C @ 20. min; Tstart: 60. C |
Capillary | DB-5 | 1068. | Miri, Ramezani, et al., 2002 | He, 4. K/min; Column length: 25. m; Column diameter: 0.25 mm; Tstart: 70. C; Tend: 260. C |
Capillary | DB-5 | 1097. | Miri, Ramezani, et al., 2002 | He, 4. K/min; Column length: 25. m; Column diameter: 0.25 mm; Tstart: 70. C; Tend: 260. C |
Capillary | RTX-5 | 1067. | Mondello, Zappia, et al., 2002 | 30. m/0.25 mm/0.25 μm, He, 45. C @ 6. min, 3. K/min, 300. C @ 10. min |
Capillary | RTX-5 | 1099. | Mondello, Zappia, et al., 2002 | 30. m/0.25 mm/0.25 μm, He, 45. C @ 6. min, 3. K/min, 300. C @ 10. min |
Capillary | CP Sil 5 CB | 1049. | Pino, Marbot, et al., 2002 | 25. m/0.25 mm/0.25 μm, N2, 60. C @ 6. min, 4. K/min; Tend: 280. C |
Capillary | RTX-5 | 1068. | Shellie, Mondello, et al., 2002 | 30. m/0.25 mm/0.25 μm, He, 45. C @ 6. min, 3. K/min; Tend: 250. C |
Capillary | RTX-5 | 1075. | Shellie, Mondello, et al., 2002 | 30. m/0.25 mm/0.25 μm, He, 45. C @ 6. min, 3. K/min; Tend: 250. C |
Capillary | OV-1 | 1082.44 | Tarján, Bitter, et al., 2002 | 25. m/0.2 mm/0.5 μm, He, 50. C @ 1. min, 2. K/min, 200. C @ 5. min |
Capillary | OV-1 | 1051.37 | Tarján, Bitter, et al., 2002 | 25. m/0.2 mm/0.5 μm, He, 50. C @ 1. min, 2. K/min, 200. C @ 5. min |
Capillary | HP-5 | 1069. | Aligiannis, Kalpoutzakis, et al., 2001 | 30. m/0.25 mm/0.25 μm, He, 60. C @ 5. min, 3. K/min; Tend: 280. C |
Capillary | HP-5MS | 1068. | Giamakis, Kretsi, et al., 2001 | 30. m/0.25 mm/0.25 μm, He, 60. C @ 5. min, 3. K/min; Tend: 280. C |
Capillary | HP-5MS | 1097. | Giamakis, Kretsi, et al., 2001 | 30. m/0.25 mm/0.25 μm, He, 60. C @ 5. min, 3. K/min; Tend: 280. C |
Capillary | BP-1 | 1053. | Lota, Serra, et al., 2001 | 50. m/0.22 mm/0.25 μm, He, 2. K/min; Tstart: 60. C; Tend: 220. C |
Capillary | HP-5MS | 1064. | Skaltsa, Mavrommati, et al., 2001 | 30. m/0.25 mm/0.25 μm, He, 60. C @ 5. min, 4. K/min; Tend: 280. C |
Capillary | HP-5MS | 1095. | Skaltsa, Mavrommati, et al., 2001 | 30. m/0.25 mm/0.25 μm, He, 60. C @ 5. min, 4. K/min; Tend: 280. C |
Capillary | BPX-5 | 1118. | Zabaras and Wyllie, 2001 | 50. m/0.22 mm/0.25 μm, H2, 60. C @ 5. min, 4. K/min, 180. C @ 5. min |
Capillary | BPX-5 | 1085. | Zabaras and Wyllie, 2001 | 50. m/0.22 mm/0.25 μm, H2, 60. C @ 5. min, 4. K/min, 180. C @ 5. min |
Capillary | BP-1 | 1054. | Baldovini, Ristorcelli, et al., 2000 | 50. m/0.22 mm/0.25 μm, 2. K/min, 220. C @ 20. min; Tstart: 60. C |
Capillary | BP-1 | 1053. | Lota, de Rocca Serra, et al., 2000 | 50. m/0.22 mm/0.25 μm, He, 2. K/min, 230. C @ 35. min; Tstart: 60. C |
Capillary | BP-1 | 1053. | Lota, de Rocca Serra, et al., 2000 | 50. m/0.22 mm/0.25 μm, He, 2. K/min, 230. C @ 35. min; Tstart: 60. C |
Capillary | Mega 5MS | 1058. | Verzera, la Rosa, et al., 2000 | 30. m/0.25 mm/0.25 μm, He, 40. C @ 2. min, 3. K/min; Tend: 240. C |
Capillary | Mega 5MS | 1058. | Verzera, Trozzi, et al., 2000 | 30. m/0.25 mm/0.25 μm, He, 40. C @ 2. min, 3. K/min; Tend: 240. C |
Capillary | Mega 5MS | 1088. | Verzera, Trozzi, et al., 2000 | 30. m/0.25 mm/0.25 μm, He, 40. C @ 2. min, 3. K/min; Tend: 240. C |
Capillary | BP-1 | 1053. | Lota, Serra, et al., 1999 | 50. m/0.22 mm/0.25 μm, He, 2. K/min, 230. C @ 35. min; Tstart: 60. C |
Capillary | DB-1 | 1060. | Mirza and Sefidkon, 1999 | 60. m/0.25 mm/0.25 μm, He, 4. K/min; Tstart: 50. C; Tend: 220. C |
Capillary | DB-1 | 1088. | Mirza and Sefidkon, 1999 | 60. m/0.25 mm/0.25 μm, He, 4. K/min; Tstart: 50. C; Tend: 220. C |
Capillary | DB-1 | 1081. | Muselli, Hoi, et al., 1999 | 30. m/0.25 mm/0.25 μm, 50. C @ 3. min, 3. K/min; Tend: 220. C |
Capillary | DB-1 | 1051. | Muselli, Hoi, et al., 1999 | 30. m/0.25 mm/0.25 μm, 50. C @ 3. min, 3. K/min; Tend: 220. C |
Capillary | HP-1 | 1076. | Stashenko, Cervantes, et al., 1999 | 60. m/0.25 mm/0.25 μm, He, 50. C @ 5. min, 2.5 K/min; Tend: 250. C |
Capillary | CP Sil 5 CB | 1087. | Weyerstahl, Marschall, et al., 1999 | He, 5. K/min; Column length: 25. m; Column diameter: 0.25 mm; Tstart: 60. C; Tend: 260. C |
Capillary | CP Sil 5 CB | 1056. | Weyerstahl, Marschall, et al., 1999 | He, 5. K/min; Column length: 25. m; Column diameter: 0.25 mm; Tstart: 60. C; Tend: 260. C |
Capillary | OV-1 | 1080. | Bicchi, Rubiolo, et al., 1998 | 25. m/0.25 mm/0.3 μm, 50. C @ 1. min, 3. K/min, 200. C @ 20. min |
Capillary | OV-1 | 1053. | Bicchi, Rubiolo, et al., 1998 | 25. m/0.25 mm/0.3 μm, 50. C @ 1. min, 3. K/min, 200. C @ 20. min |
Capillary | BP-1 | 1084. | Mariotti, Costa, et al., 1997 | 50. m/0.22 mm/0.25 μm, He, 2. K/min, 230. C @ 35. min; Tstart: 60. C |
Capillary | BP-1 | 1054. | Mariotti, Costa, et al., 1997 | 50. m/0.22 mm/0.25 μm, He, 2. K/min, 230. C @ 35. min; Tstart: 60. C |
Capillary | Methyl Silicone | 1096. | Píry, Príbela, et al., 1995 | 25. m/0.2 mm/0.3 μm, He, 2. K/min; Tstart: 40. C; Tend: 200. C |
Capillary | DB-1 | 1054. | Combariza, Tirado, et al., 1994 | 60. m/0.25 mm/0.25 μm, He, 70. C @ 5. min, 2.5 K/min, 250. C @ 15. min |
Capillary | OV-101 | 1059. | Yang, Sugisawa, et al., 1992 | N2, 2. K/min; Column length: 50. m; Column diameter: 0.25 mm; Tstart: 80. C; Tend: 200. C |
Capillary | OV-101 | 1059. | Yang, Sugisawa, et al., 1992 | N2, 2. K/min; Column length: 50. m; Column diameter: 0.25 mm; Tstart: 80. C; Tend: 200. C |
Capillary | DB-5 | 1098. | Le Quere and Latrasse, 1990 | 60. m/0.32 mm/1. μm, He, 3. K/min; Tstart: 40. C; Tend: 220. C |
Capillary | DB-5 | 1069. | Le Quere and Latrasse, 1990 | 60. m/0.32 mm/1. μm, He, 3. K/min; Tstart: 40. C; Tend: 220. C |

Van Den Dool and Kratz RI, non-polar column, custom temperature program

Column type | Active phase | I | Reference | Comment |
---|---|---|---|---|
Capillary | HP-5MS | 1106.6 | Andriamaharavo, 2014 | 30. m/0.25 mm/0.25 μm, He; Program: 60C (1 min) => 5 C/min => 210C => 10 C/min => 280C (15 min) |
Capillary | CBP-5 | 1064. | Oliveira, Campos, et al., 2005 | 30. m/0.25 mm/0.25 μm, He; Program: 60C => 3C/min => 240C => 10C/min => 280C(10min) |
Capillary | 5 % Phenyl methyl siloxane | 1070. | Sacchetti, Maietti, et al., 2005 | 30. m/0.32 mm/0.15 μm, He; Program: 45C => 1C/min => 100C => 5C/min => 250C (10min) |
Capillary | SE-52 | 1066. | Frizzo, Lorenzo, et al., 2004 | 25. m/0.32 mm/0.43 μm, H2; Program: 60C(8min) => 3C/min => 180C => 20C/min => 250C(10min) |
Capillary | SE-52 | 1095. | Frizzo, Lorenzo, et al., 2004 | 25. m/0.32 mm/0.43 μm, H2; Program: 60C(8min) => 3C/min => 180C => 20C/min => 250C(10min) |
Capillary | CBP-5 | 1062. | Azevedo, Campos, et al., 2002 | 50. m/0.25 mm/0.25 μm, He; Program: 60C(2min) => 3C/min => 240C => 10C/min => 280C(10min) |
Capillary | CBP-5 | 1091. | Azevedo, Campos, et al., 2002 | 50. m/0.25 mm/0.25 μm, He; Program: 60C(2min) => 3C/min => 240C => 10C/min => 280C(10min) |
Capillary | BP-1 | 1053. | Filippini, Tomi, et al., 2000 | Program: not specified |

Van Den Dool and Kratz RI, polar column, temperature ramp

Column type | Active phase | I | Reference | Comment |
---|---|---|---|---|
Capillary | RTX-Wax | 1451. | Bendahou, Muselli, et al., 2008 | 60. m/0.22 mm/0.25 μm, He, 2. K/min, 230. C @ 30. min; Tstart: 60. C |
Capillary | BP-20 | 1459. | Lesueur, de Rocca Serra, et al., 2007 | 50. m/0.22 mm/0.25 μm, He, 2. K/min, 220. C @ 20. min; Tstart: 60. C |
Capillary | Supelcowax-10 | 1459. | Pinto, Pina-Vaz, et al., 2006 | 30. m/0.2 mm/0.2 μm, He, 3. K/min, 220. C @ 15. min; Tstart: 70. C |
Capillary | Supelcowax-10 | 1464. | Salgueiro L.R., Pinto E., et al., 2006 | 30. m/0.2 mm/0.2 μm, He, 3. K/min, 220. C @ 15. min; Tstart: 70. C |
Capillary | Supelcowax-10 | 1459. | Salgueiro L.R., Pinto E., et al., 2006 | 30. m/0.2 mm/0.2 μm, He, 3. K/min, 220. C @ 15. min; Tstart: 70. C |
Capillary | DB-Wax | 1456. | Fanciullino, Gancel, et al., 2005 | 30. m/0.25 mm/0.25 μm, He, 3. K/min, 250. C @ 20. min; Tstart: 40. C |
Capillary | DB-Wax | 1456. | Gancel, Ollitrault, et al., 2005 | 30. m/0.25 mm/0.25 μm, He, 3. K/min, 250. C @ 20. min; Tstart: 40. C |
Capillary | Megawax | 1447. | Verzera, Trozzi, et al., 2005 | 30. m/0.25 mm/0.25 μm, He, 40. C @ 6. min, 2. K/min, 220. C @ 10. min |
Capillary | RTX-Wax | 1451. | Dugo, Mondello, et al., 2004 | 30. m/0.25 mm/0.25 μm, He, 45. C @ 6. min, 3. K/min, 240. C @ 10. min |
Capillary | BP-20 | 1462. | Gonny, Bradesi, et al., 2004 | 50. m/0.22 mm/0.25 μm, 2. K/min, 220. C @ 20. min; Tstart: 60. C |
Capillary | DB-Wax | 1456. | Gancel, Ollitrault, et al., 2003 | 60. m/0.32 mm/0.25 μm, H2, 1.5 K/min, 245. C @ 20. min; Tstart: 40. C |
Capillary | Megawax | 1447. | Verzera, Trozzi, et al., 2003 | 30. m/0.25 mm/0.25 μm, He, 40. C @ 6. min, 2. K/min, 220. C @ 10. min |
Capillary | DB-Wax | 1469. | Choi, Kim. M.-S.L., et al., 2002 | 60. m/0.25 mm/0.25 μm, N2, 2. K/min, 230. C @ 20. min; Tstart: 70. C |
Capillary | BP-20 | 1458. | Lota, de Rocca Serra, et al., 2002 | 50. m/0.22 mm/0.25 μm, He, 2. K/min, 220. C @ 20. min; Tstart: 60. C |
Capillary | RTX-Wax | 1450. | Mondello, Zappia, et al., 2002 | 30. m/0.25 mm/0.25 μm, He, 45. C @ 6. min, 3. K/min, 250. C @ 10. min |
Capillary | BP-20 | 1458. | Lota, Serra, et al., 2001 | 50. m/0.22 mm/0.25 μm, He, 2. K/min; Tstart: 60. C; Tend: 220. C |
Capillary | BP-20 | 1456. | Baldovini, Ristorcelli, et al., 2000 | 50. m/0.22 mm/0.25 μm, 2. K/min, 220. C @ 20. min; Tstart: 60. C |
Capillary | DB-Wax | 1476. | Brophy, Goldsack, et al., 2000 | 60. m/0.53 mm/1.0 μm, He, 3. K/min; Tstart: 50. C; Tend: 220. C |
Capillary | BP-20 | 1458. | Lota, de Rocca Serra, et al., 2000 | 50. m/0.22 mm/0.25 μm, He, 2. K/min, 230. C @ 35. min; Tstart: 60. C |
Capillary | BP-20 | 1458. | Lota, de Rocca Serra, et al., 2000 | 50. m/0.22 mm/0.25 μm, He, 2. K/min, 230. C @ 35. min; Tstart: 60. C |
Capillary | Megawax | 1447. | Verzera, Trozzi, et al., 2000 | 30. m/0.25 mm/0.25 μm, He, 40. C @ 6. min, 2. K/min, 220. C @ 10. min |
Capillary | BP-20 | 1458. | Lota, Serra, et al., 1999 | 50. m/0.22 mm/0.25 μm, He, 2. K/min, 230. C @ 35. min; Tstart: 60. C |
Capillary | Innowax | 1444. | Stashenko, Cervantes, et al., 1999 | 60. m/0.25 mm/0.25 μm, He, 50. C @ 5. min, 2.5 K/min; Tend: 180. C |
Capillary | Carbowax 20M | 1488. | Bicchi, Rubiolo, et al., 1998 | 25. m/0.25 mm/0.3 μm, H2, 50. C @ 1. min, 3. K/min, 200. C @ 20. min |
Capillary | BP-20 | 1459. | Mariotti, Costa, et al., 1997 | 50. m/0.22 mm/0.25 μm, He, 2. K/min, 230. C @ 35. min; Tstart: 60. C |
Capillary | Carbowax 20M | 1461. | Píry, Príbela, et al., 1995 | 50. m/0.2 mm/0.2 μm, He, 30. C @ 2. min, 4. K/min, 170. C @ 20. min |
Capillary | DB-Wax | 1463. | Combariza, Tirado, et al., 1994 | 60. m/0.25 mm/0.25 μm, He, 50. C @ 10. min, 2. K/min, 150. C @ 20. min |
Capillary | DB-Wax | 1468. | Le Quere and Latrasse, 1990 | 30. m/0.32 mm/0.5 μm, He, 3. K/min; Tstart: 40. C; Tend: 220. C |

Van Den Dool and Kratz RI, polar column, custom temperature program

Column type | Active phase | I | Reference | Comment |
---|---|---|---|---|
Capillary | RTX-Wax | 1448. | Dugo, Mondello, et al., 2004 | Program: not specified |
Capillary | BP-20 | 1455. | Filippini, Tomi, et al., 2000 | Program: not specified |
Capillary | HP-Innowax | 1470. | Bisio, Ciarallo, et al., 1998 | 30. m/0.25 mm/0.25 μm, He; Program: 60C(8min) => 3C/min => 180C(5min) => 40C/min => 250C |

Normal alkane RI, non-polar column, temperature ramp

Column type | Active phase | I | Reference | Comment |
---|---|---|---|---|
Capillary | HP-5 MS | 1079. | Sardashti, Valizadeh, et al., 2013 | 60. m/0.25 mm/0.25 μm, Helium, 40. C @ 1. min, 3. K/min, 250. C @ 20. min |
Capillary | HP-5 MS | 1070. | Ogunwande, Flamini, et al., 2010 | 30. m/0.25 mm/0.25 μm, Helium, 60. C @ 10. min, 5. K/min; Tend: 220. C |
Capillary | HP-5 MS | 1099. | Ogunwande, Flamini, et al., 2010 | 30. m/0.25 mm/0.25 μm, Helium, 60. C @ 10. min, 5. K/min; Tend: 220. C |
Capillary | DB-1-MS | 1079. | Takeoka, Hobbs, et al., 2010 | 60. m/0.25 mm/0.25 μm, Helium, 30. C @ 4. min, 2. K/min, 200. C @ 35. min |
Capillary | DB-5 | 1070. | Alim, Goze, et al., 2009 | 30. m/0.25 mm/0.25 μm, Helium, 3. K/min; Tstart: 60. C; Tend: 240. C |
Capillary | RTX-1 | 1053. | Museli, Pau, et al., 2009 | 60. m/0.22 mm/0.25 μm, Helium, 2. K/min, 230. C @ 30. min; Tstart: 60. C |
Capillary | RTX-1 | 1054. | Museli, Pau, et al., 2009 | 60. m/0.22 mm/0.25 μm, Helium, 2. K/min, 230. C @ 30. min; Tstart: 60. C |
Capillary | DB-5 | 1068. | Porto, Decorti, et al., 2009 | 30. m/0.25 mm/0.25 μm, Helium, 45. C @ 3. min, 3. K/min, 250. C @ 5. min |
Capillary | HP-5 | 1070. | Flamini, Tebano, et al., 2008 | 30. m/0.25 mm/0.25 μm, N2, 60. C @ 10. min, 5. K/min; Tend: 220. C |
Capillary | SLB-5 MS | 1069. | Lo Presti, Sciarrone, et al., 2008 | 30. m/0.25 mm/0.25 μm, Helium, 50. C @ 2. min, 3. K/min, 250. C @ 10. min |
Capillary | ZB-1 | 1075. | Mierendorff, Stahl-Biskup, et al., 2008 | 30. m/0.25 mm/0.25 μm, Nitrogen, 3. K/min; Tstart: 45. C; Tend: 230. C |
Capillary | ZB-1 | 1046. | Mierendorff, Stahl-Biskup, et al., 2008 | 30. m/0.25 mm/0.25 μm, Nitrogen, 3. K/min; Tstart: 45. C; Tend: 230. C |
Capillary | HP-5 MS | 1064. | Sahraoui, Vian, et al., 2008 | 30. m/0.25 mm/0.25 μm, Helium, 60. C @ 8. min, 2. K/min, 250. C @ 15. min |
Capillary | HP-5 MS | 1086. | Sarikurkcu, Tepe, et al., 2008 | 30. m/0.25 mm/0.25 μm, Helium, 3. K/min; Tstart: 50. C; Tend: 240. C |
Capillary | RTX-5 | 1075. | Skalicka-Wozniak, Los, et al., 2008 | 20. m/0.18 mm/0.20 μm, Helium, 50. C @ 1. min, 4. K/min; Tend: 280. C |
Capillary | DB-5 MS | 1102. | Victorio, Alviano, et al., 2008 | 30. m/0.25 mm/0.25 μm, Helium, 3. K/min; Tstart: 60. C; Tend: 270. C |
Capillary | HP-5 MS | 1065. | Adams, Beauchamp, et al., 2007 | 30. m/0.25 mm/0.25 μm, Helium, 50. C @ 10. min, 3. K/min, 230. C @ 10. min |
Capillary | HP-5 MS | 1098. | Adams, Beauchamp, et al., 2007 | 30. m/0.25 mm/0.25 μm, Helium, 50. C @ 10. min, 3. K/min, 230. C @ 10. min |
Capillary | DB-5 | 1097. | Amiri, 2007 | 50. m/0.20 mm/0.32 μm, Nitrogen, 60. C @ 3. min, 5. K/min, 220. C @ 5. min |
Capillary | DB-5 | 1064. | Amiri, 2007 | 50. m/0.20 mm/0.32 μm, Nitrogen, 60. C @ 3. min, 5. K/min, 220. C @ 5. min |
Capillary | SE-52 | 1052. | Bicchi, Cordero, et al., 2007 | 30. m/0.25 mm/0.25 μm, 50. C @ 1. min, 3. K/min, 220. C @ 5. min |
Capillary | DB-5 | 1062. | Bos, Woerdenbag, et al., 2007 | 30. m/0.26 mm/0.25 μm, He, 3. K/min; Tstart: 60. C; Tend: 240. C |
Capillary | DB-5 | 1093. | Bos, Woerdenbag, et al., 2007 | 30. m/0.26 mm/0.25 μm, He, 3. K/min; Tstart: 60. C; Tend: 240. C |
Capillary | HP-5 | 1068. | Cheraif, Ben Jannet, et al., 2007 | 30. m/0.25 mm/0.25 μm, N2, 50. C @ 1. min, 5. K/min, 240. C @ 4. min |
Capillary | HP-5 | 1097. | Cheraif, Ben Jannet, et al., 2007 | 30. m/0.25 mm/0.25 μm, N2, 50. C @ 1. min, 5. K/min, 240. C @ 4. min |
Capillary | DB-5 | 1062. | Elfami, Bos, et al., 2007 | 30. m/0.26 mm/0.25 μm, Helium, 3. K/min; Tstart: 60. C; Tend: 290. C |
Capillary | DB-5 | 1093. | Elfami, Bos, et al., 2007 | 30. m/0.26 mm/0.25 μm, Helium, 3. K/min; Tstart: 60. C; Tend: 290. C |
Capillary | DB-5 | 1093. | El-Ghorab A., El-Massry K.F., et al., 2007 | 30. m/0.25 mm/0.25 μm, He, 3. K/min, 220. C @ 40. min; Tstart: 35. C |
Capillary | HP-5MS | 1112. | Ferhat, Meklati, et al., 2007 | 30. m/0.25 mm/0.25 μm, He, 60. C @ 8. min, 2. K/min, 250. C @ 15. min |
Capillary | 5 % Phenyl methyl siloxane | 1071. | Gil A., Van Baren C.M., et al., 2007 | 60. m/0.25 mm/0.25 μm, He, 3. K/min, 225. C @ 15. min; Tstart: 90. C |
Capillary | Col-Elite 5MS | 1074. | Gudaityte and Venskutonis R.P., 2007 | 30. m/0.25 mm/0.25 μm, He, 3. K/min; Tstart: 30. C; Tend: 246. C |
Capillary | HP-1 | 1044. | Hachicha, Skanji, et al., 2007 | 30. m/0.25 mm/0.25 μm, He, 2. K/min, 240. C @ 20. min; Tstart: 60. C |
Capillary | RTX-5 MS | 1070. | Hudaib and Aburjai, 2007 | 30. m/0.25 mm/0.25 μm, He, 3. K/min; Tstart: 45. C; Tend: 210. C |
Capillary | RTX-5 MS | 1104. | Hudaib and Aburjai, 2007 | 30. m/0.25 mm/0.25 μm, He, 3. K/min; Tstart: 45. C; Tend: 210. C |
Capillary | ZB-5 | 1070. | Mohottalage, Tabacchi, et al., 2007 | 30. m/0.25 mm/0.25 μm, 60. C @ 5. min, 4. K/min, 220. C @ 20. min |
Capillary | ZB-5 | 1106. | Mohottalage, Tabacchi, et al., 2007 | 30. m/0.25 mm/0.25 μm, 60. C @ 5. min, 4. K/min, 220. C @ 20. min |
Capillary | DB-1 | 1077. | Monser-Esfahani, Karamkhani, et al., 2007 | 30. m/0.25 mm/0.25 μm, Helium, 50. C @ 1. min, 2.5 K/min, 260. C @ 20. min |
Capillary | DB-1 | 1047. | Monser-Esfahani, Karamkhani, et al., 2007 | 30. m/0.25 mm/0.25 μm, Helium, 50. C @ 1. min, 2.5 K/min, 260. C @ 20. min |
Capillary | SPB-1 | 1077. | Pinto, Salgueiro, et al., 2007 | 30. m/0.2 mm/0.2 μm, He, 3. K/min, 220. C @ 15. min; Tstart: 70. C |
Capillary | DB-1 | 1056. | Salehi, Fakhari, et al., 2007 | 60. m/0.25 mm/0.25 μm, He, 5. K/min; Tstart: 60. C; Tend: 250. C |
Capillary | DB-5 | 1066. | Sefidkon, Abbasi, et al., 2007 | 30. m/0.25 mm/0.25 μm, He, 4. K/min; Tstart: 50. C; Tend: 240. C |
Capillary | DB-5 | 1053. | Tiwary, Nail, et al., 2007 | Helium, 2. K/min, 200. C @ 20. min; Column length: 30. m; Column diameter: 0.25 mm; Tstart: 60. C |
Capillary | DB-5 | 1068. | Tiwary, Nail, et al., 2007 | Helium, 2. K/min, 200. C @ 20. min; Column length: 30. m; Column diameter: 0.25 mm; Tstart: 60. C |
Capillary | HP-5MS | 1033. | Tzakou, Bazos, et al., 2007 | 30. m/0.25 mm/0.25 μm, He, 3. K/min; Tstart: 60. C; Tend: 280. C |
Capillary | HP-5MS | 1065. | Tzakou, Bazos, et al., 2007 | 30. m/0.25 mm/0.25 μm, He, 3. K/min; Tstart: 60. C; Tend: 280. C |
Capillary | HP-5 MS | 1070. | Vagionas, Graikou, et al., 2007 | 30. m/0.25 mm/0.25 μm, Helium, 3. K/min; Tstart: 60. C; Tend: 280. C |
Capillary | HP-5MS | 1060. | Vichi, Riu-Aumatell, et al., 2007 | 30. m/0.25 mm/0.25 μm, He, 40. C @ 5. min, 3. K/min, 250. C @ 10. min |
Capillary | ZB-5 | 1070. | Biondi, Sari, et al., 2006 | 30. m/0.25 mm/0.25 μm, 2. K/min; Tstart: 40. C; Tend: 300. C |
Capillary | ZB-5 | 1097. | Biondi, Sari, et al., 2006 | 30. m/0.25 mm/0.25 μm, 2. K/min; Tstart: 40. C; Tend: 300. C |
Capillary | AT-5 | 1067. | Borges, Rojas, et al., 2006 | 60. m/0.25 mm/0.25 μm, He, 4. K/min, 200. C @ 20. min; Tstart: 60. C |
Capillary | HP-5 | 1068. | Coronel, Cerda-Garcia-Rojas, et al., 2006 | 30. m/0.32 mm/0.25 μm, He, 3. K/min; Tstart: 60. C; Tend: 246. C |
Capillary | HP-5 | 1096. | Coronel, Cerda-Garcia-Rojas, et al., 2006 | 30. m/0.32 mm/0.25 μm, He, 3. K/min; Tstart: 60. C; Tend: 246. C |
Capillary | HP-5MS | 1071. | Ebrahim Sajjadi and Mehregan, 2006 | 30. m/0.25 mm/0.25 μm, 4. K/min; Tstart: 60. C; Tend: 280. C |
Capillary | HP-5MS | 1100. | Ebrahim Sajjadi and Mehregan, 2006 | 30. m/0.25 mm/0.25 μm, 4. K/min; Tstart: 60. C; Tend: 280. C |
Capillary | DB-5 | 1062. | Elfami, Komar, et al., 2006 | 30. m/0.26 mm/0.25 μm, Helium, 3. K/min; Tstart: 60. C; Tend: 290. C |
Capillary | DB-5 | 1093. | Elfami, Komar, et al., 2006 | 30. m/0.26 mm/0.25 μm, Helium, 3. K/min; Tstart: 60. C; Tend: 290. C |
Capillary | BP-1 | 1050. | Fanciullino, Tomi, et al., 2006 | 50. m/0.22 mm/0.25 μm, He, 2. K/min, 220. C @ 20. min; Tstart: 60. C |
Capillary | HP-5 | 1073. | Figuérédo, Cabassu, et al., 2006 | 30. m/0.25 mm/0.25 μm, He, 50. C @ 5. min, 5. K/min, 300. C @ 5. min |
Capillary | HP-5 | 1109. | Figuérédo, Cabassu, et al., 2006 | 30. m/0.25 mm/0.25 μm, He, 50. C @ 5. min, 5. K/min, 300. C @ 5. min |
Capillary | HP-1 | 1053. | Filippi, Lanfranchi, et al., 2006 | 50. m/0.2 mm/0.33 μm, He, 2. K/min, 250. C @ 40. min; Tstart: 60. C |
Capillary | DB-5 | 1072. | Havlik, Kokoska, et al., 2006 | 30. m/0.25 mm/0.25 μm, He, 3. K/min, 250. C @ 10. min; Tstart: 50. C |
Capillary | DB-1 | 1056. | Lan Phi N.T., Nishiyama C., et al., 2006 | 60. m/0.25 mm/0.25 μm, 70. C @ 2. min, 2. K/min, 230. C @ 20. min |
Capillary | CP Sil 8 CB | 1074. | Li, Lee, et al., 2006 | 30. m/0.25 mm/0.25 μm, 40. C @ 5. min, 3. K/min, 250. C @ 20. min |
Capillary | CP Sil 5 CB | 1057. | Martin, Joseph, et al., 2006 | 30. m/0.25 mm/0.25 μm, N2, 5. K/min; Tstart: 50. C; Tend: 200. C |
Capillary | 5 % Phenyl methyl siloxane | 1041. | Marongiu, Piras, et al., 2006 | 30. m/0.25 mm/0.25 μm, Helium, 3. K/min, 280. C @ 30. min; Tstart: 60. C |
Capillary | DB-5 | 1065. | Ouamba, Ouabonzi, et al., 2006 | 25. m/0.25 mm/0.15 μm, N2, 50. C @ 3. min, 4. K/min; Tend: 200. C |
Capillary | SE-52 | 1068. | Ozcan, Chalchat, et al., 2006 | Helium, 3. K/min; Column length: 50. m; Column diameter: 0.25 mm; Tstart: 50. C; Tend: 240. C |
Capillary | HP-5 | 1099. | Pintore G., Chessa M., et al., 2006 | 30. m/0.25 mm/0.25 μm, He, 60. C @ 10. min, 5. K/min; Tend: 220. C |
Capillary | DB-5 | 1068. | Pino, Marbot, et al., 2006 | 30. m/0.25 mm/0.25 μm, Hydrogen, 70. C @ 4. min, 4. K/min; Tend: 280. C |
Capillary | DB-5 | 1104. | Sabulal, Dan, et al., 2006 | 30. m/0.25 mm/0.25 μm, He, 5. K/min; Tstart: 60. C; Tend: 260. C |
Capillary | DB-5 | 1068. | Sefidkon and Jamzad, 2006 | 30. m/0.25 mm/0.25 μm, He, 4. K/min; Tstart: 40. C; Tend: 240. C |
Capillary | DB-1 | 1051. | Sefidkon, Jamzad, et al., 2006 | He, 4. K/min; Column length: 60. m; Column diameter: 0.25 mm; Tstart: 40. C; Tend: 250. C |
Capillary | DB-5 | 1069. | Silva, Oliveira, et al., 2006 | 30. m/0.20 mm/0.18 μm, H2, 3. K/min; Tstart: 60. C; Tend: 240. C |
Capillary | DB-1 | 1053. | Velasco-Negueruela, Pérez-Alonso, et al., 2006 | 50. m/0.25 mm/0.25 μm, N2, 4. K/min; Tstart: 90. C; Tend: 240. C |
Capillary | HP-5MS | 1062. | Basta, Tzakou, et al., 2005 | 30. m/0.25 mm/0.25 μm, He, 3. K/min; Tstart: 60. C; Tend: 280. C |
Capillary | HP-5MS | 1095. | Basta, Tzakou, et al., 2005 | 30. m/0.25 mm/0.25 μm, He, 3. K/min; Tstart: 60. C; Tend: 280. C |
Capillary | DB-5 | 1070. | Chagonda and Chalchat, 2005 | 50. m/0.3 mm/0.25 μm, 2. K/min; Tstart: 60. C; Tend: 240. C |
Capillary | Methyl Silicone | 1066. | Chalchat and Özcan, 2005 | He, 3. K/min; Column length: 60. m; Column diameter: 0.3 mm; Tstart: 50. C; Tend: 240. C |
Capillary | HP-5 | 1073. | Figuérédo, Cabassu, et al., 2005 | 30. m/0.25 mm/0.25 μm, He, 50. C @ 5. min, 5. K/min, 300. C @ 5. min |
Capillary | HP-5 | 1109. | Figuérédo, Cabassu, et al., 2005 | 30. m/0.25 mm/0.25 μm, He, 50. C @ 5. min, 5. K/min, 300. C @ 5. min |
Capillary | HP-5MS | 1100. | Melkani, Dev, et al., 2005 | 30. m/0.25 mm/0.25 μm, 50. C @ 10. min, 3. K/min, 250. C @ 5. min |
Capillary | DB-5 | 1072. | Morteza-Semnani and Saeedi, 2005 | 30. m/0.25 mm/0.25 μm, He, 60. C @ 4. min, 4. K/min; Tend: 220. C |
Capillary | HP-5 | 1099. | Oyedeji, Yani, et al., 2005 | 30. m/0.25 mm/0.25 μm, He, 5. K/min; Tstart: 70. C; Tend: 240. C |
Capillary | HP-5 | 1066. | Oyedeji, Yani, et al., 2005 | 30. m/0.25 mm/0.25 μm, He, 5. K/min; Tstart: 70. C; Tend: 240. C |
Capillary | DB-5 | 1073. | Özel, Gögüs, et al., 2005 | 30. m/0.32 mm/0.25 μm, He, 40. C @ 0.5 min, 5. K/min, 250. C @ 2. min |
Capillary | DB-1 | 1096. | Rasooli and Owlia, 2005 | 60. m/0.25 mm/0.25 μm, He, 4. K/min; Tstart: 50. C; Tend: 250. C |
Capillary | DB-1 | 1036. | Rasooli and Owlia, 2005 | 60. m/0.25 mm/0.25 μm, He, 4. K/min; Tstart: 50. C; Tend: 250. C |
Capillary | DB-5 | 1079. | Rout, Misra, et al., 2005 | 25. m/0.25 mm/0.25 μm, He, 2. K/min, 200. C @ 80. min; Tstart: 60. C |
Capillary | DB-5 | 1091. | Rout, Misra, et al., 2005 | 25. m/0.25 mm/0.25 μm, He, 2. K/min, 200. C @ 80. min; Tstart: 60. C |
Capillary | HP-5 | 1068. | Saeidnia, Gohari, et al., 2005 | He, 5. K/min; Column length: 30. m; Column diameter: 0.25 mm; Tstart: 60. C; Tend: 240. C |
Capillary | HP-5MS | 1068. | Sajjadi S.E. and Eskandari B., 2005 | 30. m/0.25 mm/0.25 μm, He, 4. K/min; Tstart: 60. C; Tend: 280. C |
Capillary | HP-5MS | 1069. | Sajjadi and Ghannadi, 2005 | 30. m/0.25 mm/0.25 μm, He, 4. K/min; Tstart: 60. C; Tend: 275. C |
Capillary | HP-5MS | 1102. | Sajjadi and Ghannadi, 2005 | 30. m/0.25 mm/0.25 μm, He, 4. K/min; Tstart: 60. C; Tend: 275. C |
Capillary | HP-5MS | 1068. | Sajjadi, 2005 | 30. m/0.25 mm/0.25 μm, He, 4. K/min; Tstart: 60. C; Tend: 280. C |
Capillary | HP-5MS | 1096. | Sajjadi, 2005 | 30. m/0.25 mm/0.25 μm, He, 4. K/min; Tstart: 60. C; Tend: 280. C |
Capillary | DB-1 | 1082. | Salehi, Sonboli, et al., 2005 | 60. m/0.25 mm/0.25 μm, He, 5. K/min, 250. C @ 10. min; Tstart: 60. C |
Capillary | DB-5 | 1068. | Sefidkon and Jamzad, 2005 | He, 4. K/min; Column length: 30. m; Column diameter: 0.25 mm; Tstart: 40. C; Tend: 240. C |
Capillary | DB-5 | 1096. | Sefidkon and Jamzad, 2005 | He, 4. K/min; Column length: 30. m; Column diameter: 0.25 mm; Tstart: 40. C; Tend: 240. C |
Capillary | DB-5 | 1070. | Skoula and Grayer, 2005 | 30. m/0.25 mm/0.25 μm, He, 3. K/min, 230. C @ 20. min; Tstart: 60. C |
Capillary | DB-5 | 1098. | Skoula and Grayer, 2005 | 30. m/0.25 mm/0.25 μm, He, 3. K/min, 230. C @ 20. min; Tstart: 60. C |
Capillary | HP-5MS | 1068. | Slavkovska, Couladis, et al., 2005 | 30. m/0.25 mm/0.25 μm, He, 3. K/min; Tstart: 60. C; Tend: 280. C |
Capillary | HP-5MS | 1098. | Slavkovska, Couladis, et al., 2005 | 30. m/0.25 mm/0.25 μm, He, 3. K/min; Tstart: 60. C; Tend: 280. C |
Capillary | DB-1 | 1056. | Sonboli, Salehi, et al., 2005 | 60. m/0.25 mm/0.25 μm, He, 5. K/min, 250. C @ 10. min; Tstart: 60. C |
Capillary | HP-5MS | 1073. | Tepe B., Sokmen M., et al., 2005 | 30. m/0.25 mm/0.25 μm, He, 50. C @ 3. min, 3. K/min; Tend: 240. C |
Capillary | HP-5MS | 1111. | Tepe B., Sokmen M., et al., 2005 | 30. m/0.25 mm/0.25 μm, He, 50. C @ 3. min, 3. K/min; Tend: 240. C |
Capillary | HP-5MS | 1033. | Tzakou, Bazos, et al., 2005 | 30. m/0.25 mm/0.25 μm, He, 3. K/min; Tstart: 60. C; Tend: 280. C |
Capillary | HP-5MS | 1061. | Tzakou, Bazos, et al., 2005 | 30. m/0.25 mm/0.25 μm, He, 3. K/min; Tstart: 60. C; Tend: 280. C |
Capillary | DB-5 | 1038. | Tzakou and Constantinidis, 2005 | 30. m/0.32 mm/0.25 μm, He, 3. K/min; Tstart: 60. C; Tend: 280. C |
Capillary | HP-5 | 1059. | Utsunomia, Kawata, et al., 2005 | 30. m/0.32 mm/0.25 μm, Helium, 4. K/min, 300. C @ 5. min; Tstart: 40. C |
Capillary | HP-5 MS | 1070. | Ghannadi, Sajjadi, et al., 2004 | 30. m/0.25 mm/0.25 μm, Helium, 4. K/min; Tstart: 60. C; Tend: 275. C |
Capillary | DB-5 | 1068. | JAvidnia, Mojab, et al., 2004 | 25. m/0.25 mm/0.25 μm, Nitrogen, 3. K/min; Tstart: 60. C; Tend: 240. C |
Capillary | DB-5 | 1066. | Kalvandi, Sefidkon, et al., 2004 | 60. m/0.25 mm/0.25 μm, He, 40. C @ 4. min, 4. K/min; Tend: 280. C |
Capillary | RTX-1 | 1087. | Kalemba and Thiem, 2004 | 30. m/0.25 mm/0.25 μm, N2, 4. K/min; Tstart: 60. C; Tend: 300. C |
Capillary | DB-5MS | 1039. | Marongiu, Piras, et al., 2004 | 30. m/0.25 mm/0.25 μm, He, 3. K/min, 280. C @ 30. min; Tstart: 60. C |
Capillary | NB-30 | 1057. | Orav, Stulova, et al., 2004 | 50. m/0.2 mm/0.25 μm, He, 2. K/min; Tstart: 50. C; Tend: 250. C |
Capillary | NB-30 | 1058. | Orav, Stulova, et al., 2004 | 50. m/0.2 mm/0.25 μm, He, 2. K/min; Tstart: 50. C; Tend: 250. C |
Capillary | NB-30 | 1058. | Raal, Paaver, et al., 2004 | 50. m/0.20 mm/0.25 μm, He, 2. K/min; Tstart: 50. C; Tend: 250. C |
Capillary | DB-1 | 1036. | Rasooli and Razzaghi Abyaneh, 2004 | 60. m/0.25 mm/0.25 μm, He, 4. K/min; Tstart: 50. C; Tend: 250. C |
Capillary | DB-1 | 1096. | Rasooli and Razzaghi Abyaneh, 2004 | 60. m/0.25 mm/0.25 μm, He, 4. K/min; Tstart: 50. C; Tend: 250. C |
Capillary | HP-5MS | 1065. | Sadeghpour, Asghari, et al., 2004 | 30. m/0.25 mm/0.25 μm, He, 4. K/min; Tstart: 60. C; Tend: 280. C |
Capillary | HP-5MS | 1067. | Sajjadi and Shahpiri, 2004 | 30. m/0.25 mm/0.25 μm, He, 4. K/min; Tstart: 60. C; Tend: 280. C |
Capillary | DB-5 | 1096. | Sefidkon, Jamzad, et al., 2004 | 30. m/0.25 mm/0.25 μm, 50. C @ 5. min, 3. K/min; Tend: 250. C |
Capillary | HP-1 | 1118. | Senatore, Napolitano, et al., 2004 | 30. m/0.25 mm/0.33 μm, He, 40. C @ 5. min, 2. K/min, 260. C @ 20. min |
Capillary | HP-5 | 1072. | Shafi, Nambiar, et al., 2004 | 25. m/0.2 mm/0.5 μm, N2, 3. K/min; Tstart: 30. C; Tend: 280. C |
Capillary | HP-5MS | 1068. | Afsharypuor and Jahromy, 2003 | 30. m/0.25 mm/0.25 μm, He, 4. K/min; Tstart: 60. C; Tend: 275. C |
Capillary | DB-5 | 1067. | Cabanillas, Lopez, et al., 2003 | 30. m/0.25 mm/0.25 μm, He, 4. K/min; Tstart: 60. C; Tend: 240. C |
Capillary | DB-1 | 1092. | Dabiri and Sefidkon, 2003 | He, 4. K/min; Column length: 60. m; Column diameter: 0.25 mm; Tstart: 50. C; Tend: 250. C |
Capillary | DB-1 | 1054. | Ebrahimzadeh, Yamini, et al., 2003 | 60. m/0.25 mm/0.25 μm, He, 4. K/min; Tstart: 50. C; Tend: 250. C |
Capillary | DB-5 | 1110. | Edris and Farrag, 2003 | He, 3. K/min; Column length: 60. m; Column diameter: 0.32 mm; Tstart: 50. C; Tend: 220. C |
Capillary | DB-5 | 1074. | Edris and Farrag, 2003 | He, 3. K/min; Column length: 60. m; Column diameter: 0.32 mm; Tstart: 50. C; Tend: 220. C |
Capillary | DB-5 | 1110. | Edris, Shalaby, et al., 2003 | He, 3. K/min; Column length: 60. m; Column diameter: 0.32 mm; Tstart: 50. C; Tend: 200. C |
Capillary | DB-5 | 1074. | Edris, Shalaby, et al., 2003 | He, 3. K/min; Column length: 60. m; Column diameter: 0.32 mm; Tstart: 50. C; Tend: 200. C |
Capillary | HP-5MS | 1072. | Feizbaksh, Saber Tehrani, et al., 2003 | 30. m/0.25 mm/0.25 μm, He, 60. C @ 20. min, 5. K/min, 220. C @ 20. min |
Capillary | HP-5MS | 1065. | Ghannadi, Aghazari, et al., 2003 | 30. m/0.25 mm/0.25 μm, He, 4. K/min; Tstart: 60. C; Tend: 275. C |
Capillary | RSL-200 | 1092. | Jirovetz, Buchbauer, et al., 2003 | 30. m/0.32 mm/0.25 μm, H2, 40. C @ 5. min, 6. K/min, 280. C @ 5. min |
Capillary | RSL-200 | 1060. | Jirovetz, Buchbauer, et al., 2003 | 30. m/0.32 mm/0.25 μm, H2, 40. C @ 5. min, 6. K/min, 280. C @ 5. min |
Capillary | DB-5 | 1070. | Machado, Zoghbi, et al., 2003 | 30. m/0.25 mm/0.25 μm, He, 3. K/min; Tstart: 60. C; Tend: 240. C |
Capillary | DB-1 | 1044. | Mahalwal and Ali, 2003 | 30. m/0.25 mm/0.25 μm, N2, 4. K/min; Tstart: 80. C; Tend: 250. C |
Capillary | DB-5MS | 1097. | Maia, Taveira, et al., 2003 | 30. m/0.25 mm/0.25 μm, He, 3. K/min; Tstart: 60. C; Tend: 240. C |
Capillary | DB-5 | 1067. | Masotti, Juteau, et al., 2003 | 50. m/0.2 mm/0.25 μm, He, 50. C @ 2. min, 3. K/min; Tend: 220. C |
Capillary | DB-5 | 1098. | Masotti, Juteau, et al., 2003 | 50. m/0.2 mm/0.25 μm, He, 50. C @ 2. min, 3. K/min; Tend: 220. C |
Capillary | ZB-1 | 1075. | Mierendorff, Stahl-Biskup, et al., 2003 | 30. m/0.25 mm/0.25 μm, N2, 3. K/min; Tstart: 45. C; Tend: 230. C |
Capillary | ZB-1 | 1046. | Mierendorff, Stahl-Biskup, et al., 2003 | 30. m/0.25 mm/0.25 μm, N2, 3. K/min; Tstart: 45. C; Tend: 230. C |
Capillary | HP-5 | 1068. | Mookdasanit, Tamura, et al., 2003 | Helium, 2. K/min, 210. C @ 60. min; Column length: 30. m; Column diameter: 0.32 mm; Tstart: 70. C |
Capillary | HP-5 | 1097. | Mookdasanit, Tamura, et al., 2003 | Helium, 2. K/min, 210. C @ 60. min; Column length: 30. m; Column diameter: 0.32 mm; Tstart: 70. C |
Capillary | DB-1 | 1085. | Perez-Alonso, Velasco-Negueruela, et al., 2003 | 50. m/0.25 mm/0.25 μm, N2, 4. K/min; Tstart: 95. C; Tend: 240. C |
Capillary | DB-1 | 1062. | Perez-Alonso, Velasco-Negueruela, et al., 2003 | 50. m/0.25 mm/0.25 μm, N2, 4. K/min; Tstart: 95. C; Tend: 240. C |
Capillary | DB-5 | 1068. | Pino, Marbot, et al., 2003 | 30. m/0.25 mm/0.25 μm, H2, 60. C @ 10. min, 4. K/min, 280. C @ 40. min |
Capillary | DB-5 | 1096. | Pino, Marbot, et al., 2003 | 30. m/0.25 mm/0.25 μm, H2, 60. C @ 10. min, 4. K/min, 280. C @ 40. min |
Capillary | HP-5 | 1051. | Pitarokili, Tzakou, et al., 2003 | 30. m/0.25 mm/0.25 μm, He, 3. K/min; Tstart: 60. C; Tend: 280. C |
Capillary | HP-5 | 1086. | Pitarokili, Tzakou, et al., 2003 | 30. m/0.25 mm/0.25 μm, He, 3. K/min; Tstart: 60. C; Tend: 280. C |
Capillary | DB-1 | 1052. | Rasooli and Mirmostafa, 2003 | 60. m/0.25 mm/0.25 μm, He, 4. K/min; Tstart: 40. C; Tend: 220. C |
Capillary | DB-1 | 1058. | Rasooli and Mirmostafa, 2003 | 60. m/0.25 mm/0.25 μm, He, 4. K/min; Tstart: 40. C; Tend: 220. C |
Capillary | HP-5 | 1067. | Sajjadi and Mehregan, 2003 | 30. m/0.25 mm/0.25 μm, He, 4. K/min; Tstart: 60. C; Tend: 280. C |
Capillary | DB-1 | 1087. | Shahmir, Ahmadi, et al., 2003 | 60. m/0.25 mm/0.25 μm, He, 4. K/min; Tstart: 50. C; Tend: 280. C |
Capillary | DB-1 | 1060. | Shahmir, Ahmadi, et al., 2003 | 60. m/0.25 mm/0.25 μm, He, 4. K/min; Tstart: 50. C; Tend: 280. C |
Capillary | DB-5 | 1068. | Bos, Koulman, et al., 2002 | 30. m/0.249 mm/0.25 μm, He, 3. K/min, 300. C @ 5. min; Tstart: 60. C |
Capillary | DB-5 | 1097. | Bos, Koulman, et al., 2002 | 30. m/0.249 mm/0.25 μm, He, 3. K/min, 300. C @ 5. min; Tstart: 60. C |
Capillary | 5 % Phenyl methyl siloxane | 1070. | Cicció and Gómez-Laurito, 2002 | 30. m/0.25 mm/0.25 μm, He, 75. C @ 4. min, 3. K/min, 200. C @ 8. min |
Capillary | RSL-200 | 1073. | Jirovetz, Buchbauer, et al., 2002 | 30. m/0.32 mm/0.25 μm, H2, 40. C @ 5. min, 6. K/min, 280. C @ 5. min |
Capillary | RSL-200 | 1110. | Jirovetz, Buchbauer, et al., 2002 | 30. m/0.32 mm/0.25 μm, H2, 40. C @ 5. min, 6. K/min, 280. C @ 5. min |
Capillary | DB-5 | 1098. | Kobaisy, Tellez, et al., 2002 | 30. m/0.25 mm/0.25 μm, He, 3. K/min; Tstart: 60. C; Tend: 240. C |
Capillary | DB-5MS | 1066. | Maia, Zoghbi, et al., 2002 | 30. m/0.25 mm/0.25 μm, He, 3. K/min; Tstart: 60. C; Tend: 240. C |
Capillary | DB-5MS | 1096. | Maia, Zoghbi, et al., 2002 | 30. m/0.25 mm/0.25 μm, He, 3. K/min; Tstart: 60. C; Tend: 240. C |
Capillary | HP-5 | 1099. | Novak, Langbehn, et al., 2002 | 30. m/0.25 mm/0.25 μm, 3. K/min; Tstart: 60. C; Tend: 240. C |
Capillary | HP-5 | 1101. | Novak, Langbehn, et al., 2002 | 30. m/0.25 mm/0.25 μm, 3. K/min; Tstart: 60. C; Tend: 240. C |
Capillary | HP-5 | 1070. | Novak, Langbehn, et al., 2002 | 30. m/0.25 mm/0.25 μm, 3. K/min; Tstart: 60. C; Tend: 240. C |
Capillary | HP-5 | 1074. | Novak, Langbehn, et al., 2002 | 30. m/0.25 mm/0.25 μm, 3. K/min; Tstart: 60. C; Tend: 240. C |
Capillary | DB-1 | 1051. | Palá-Paúl, Pérez-Alonso, et al., 2002 | 50. m/0.25 mm/0.25 μm, N2, 4. K/min; Tstart: 80. C; Tend: 225. C |
Capillary | DB-1 | 1053. | Sefidkon, Jalili, et al., 2002 | 60. m/0.25 mm/0.25 μm, He, 40. C @ 5. min, 4. K/min; Tend: 280. C |
Capillary | DB-1 | 1053. | Sefidkon, 2002 | 60. m/0.25 mm/0.25 μm, He, 40. C @ 5. min, 4. K/min; Tend: 280. C |
Capillary | DB-5MS | 1069. | Zoghbi, Andrade, et al., 2002 | 30. m/0.25 mm/0.25 μm, He, 3. K/min; Tstart: 60. C; Tend: 270. C |
Capillary | DB-5MS | 1097. | Zoghbi, Andrade, et al., 2002 | 30. m/0.25 mm/0.25 μm, He, 3. K/min; Tstart: 60. C; Tend: 270. C |
Capillary | DB-5 | 1065. | Zoghbi, Andrade, et al., 2002, 2 | 30. m/0.25 mm/0.25 μm, He, 3. K/min; Tstart: 60. C; Tend: 240. C |
Capillary | DB-5MS | 1061. | Cherchi, Deidda, et al., 2001 | 30. m/0.25 mm/0.25 μm, He, 3. K/min; Tstart: 60. C; Tend: 240. C |
Capillary | DB-5MS | 1089. | Cherchi, Deidda, et al., 2001 | 30. m/0.25 mm/0.25 μm, He, 3. K/min; Tstart: 60. C; Tend: 240. C |
Capillary | DB-1 | 1044. | Dabiri and Sefidkon, 2001 | 60. m/0.25 mm/0.25 μm, He, 40. C @ 5. min, 4. K/min; Tend: 280. C |
Capillary | DB-1 | 1054. | Dabiri and Sefidkon, 2001 | 60. m/0.25 mm/0.25 μm, He, 40. C @ 5. min, 4. K/min; Tend: 280. C |
Capillary | DB-5MS | 1106. | Fernando and Grün, 2001 | 60. m/0.25 mm/0.25 μm, He, 35. C @ 5. min, 3. K/min; Tend: 250. C |
Capillary | HP-5 | 1070. | Gallori, Flamini, et al., 2001 | 30. m/0.25 mm/0.25 μm, N2, 60. C @ 10. min, 5. K/min; Tend: 220. C |
Capillary | BP-1 | 1053. | Lota, de Rocca Serra, et al., 2001 | 50. m/0.22 mm/0.25 μm, He, 2. K/min, 230. C @ 35. min; Tstart: 60. C |
Capillary | DB-5MS | 1044. | Marongiu, Porcedda, et al., 2001 | 30. m/0.25 mm/0.25 μm, He, 3. K/min, 240. C @ 30. min; Tstart: 60. C |
Capillary | DB-1 | 1061. | Mirza, Ahmadi, et al., 2001 | 60. m/0.25 mm/0.25 μm, He, 4. K/min; Tstart: 50. C; Tend: 270. C |
Capillary | OV-101 | 1055. | Orav and Kann, 2001 | He, 2. K/min; Column length: 50. m; Column diameter: 0.2 mm; Tstart: 50. C; Tend: 250. C |
Capillary | OV-101 | 1059. | Yang, 2001 | N2, 2. K/min; Column length: 50. m; Column diameter: 0.25 mm; Tstart: 80. C; Tend: 200. C |
Capillary | CP Sil 5 CB | 1052. | Asekun and Ekundayo, 2000 | 25. m/0.25 mm/0.15 μm, 3. K/min; Tstart: 50. C; Tend: 230. C |
Capillary | DB-1 | 1101. | Mallavarapu, Rao, et al., 2000 | 25. m/0.50 mm/0.25 μm, Nitrogen, 5. K/min; Tstart: 60. C; Tend: 220. C |
Capillary | DB-1 | 1058. | Mallavarapu, Rao, et al., 2000 | 25. m/0.50 mm/0.25 μm, Nitrogen, 5. K/min; Tstart: 60. C; Tend: 220. C |
Capillary | BP-1 | 1070. | Mohagheghzadeh, Shams-Ardakani, et al., 2000 | 25. m/0.33 mm/1.0 μm, N2, 4. K/min; Tstart: 60. C; Tend: 275. C |
Capillary | HP-5 | 1068. | Mohagheghzadeh, Shams-Ardakani, et al., 2000, 2 | 30. m/0.25 mm/0.25 μm, He, 4. K/min; Tstart: 60. C; Tend: 275. C |
Capillary | RTX-1 | 1087. | Kalemba, 1999 | 30. m/0.25 mm/0.25 μm, N2, 4. K/min; Tstart: 60. C; Tend: 300. C |
Capillary | RTX-1 | 1059. | Kalemba, 1999 | 30. m/0.25 mm/0.25 μm, N2, 4. K/min; Tstart: 60. C; Tend: 300. C |
Capillary | DB-1 | 1068. | Koulman, 1999 | 25. m/0.25 mm/0.25 μm, He, 4. K/min; Tstart: 50. C; Tend: 290. C |
Capillary | DB-1 | 1097. | Koulman, 1999 | 25. m/0.25 mm/0.25 μm, He, 4. K/min; Tstart: 50. C; Tend: 290. C |
Capillary | CBP-1 | 1067. | Labuckas, Zygadlo, et al., 1999 | He, 4. K/min; Column length: 25. m; Column diameter: 0.3 mm; Tstart: 60. C; Tend: 240. C |
Capillary | OV-1 | 1062. | Oberhofer, Nikiforov, et al., 1999 | 25. m/0.25 mm/0.25 μm, H2, 40. C @ 5. min, 3. K/min, 220. C @ 5. min |
Capillary | SE-30 | 1057. | Prikhod'ko, Klyuev, et al., 1999 | 30. m/0.25 mm/0.20 μm, Helium, 60. C @ 4. min, 3. K/min; Tend: 200. C |
Capillary | BP-1 | 1059. | Rao, Bhattacharya, et al., 1999 | N2, 5. K/min, 220. C @ 10. min; Column length: 25. m; Column diameter: 0.5 mm; Tstart: 60. C |
Capillary | CP Sil 5 CB | 1088. | Rustaiyan and Nadji, 1999 | 25. m/0.25 mm/0.39 μm, N2, 5. K/min; Tstart: 60. C; Tend: 220. C |
Capillary | CP Sil 5 CB | 1059. | Rustaiyan and Nadji, 1999 | 25. m/0.25 mm/0.39 μm, N2, 5. K/min; Tstart: 60. C; Tend: 220. C |
Capillary | DB-1 | 1085. | Sefidkon, Dabiri, et al., 1999 | 60. m/0.25 mm/0.25 μm, He, 40. C @ 5. min, 4. K/min; Tend: 280. C |
Capillary | DB-1 | 1055. | Sefidkon, Dabiri, et al., 1999 | 60. m/0.25 mm/0.25 μm, He, 40. C @ 5. min, 4. K/min; Tend: 280. C |
Capillary | DB-1 | 1064. | Sefidkon and Mirza, 1999 | 60. m/0.25 mm/0.25 μm, He, 4. K/min; Tstart: 50. C; Tend: 220. C |
Capillary | DB-5 | 1069. | Tellez, Canel, et al., 1999 | 30. m/0.25 mm/0.25 μm, He, 3. K/min; Tstart: 60. C; Tend: 240. C |
Capillary | DB-5 | 1097. | Tellez, Canel, et al., 1999 | 30. m/0.25 mm/0.25 μm, He, 3. K/min; Tstart: 60. C; Tend: 240. C |
Capillary | OV-101 | 1059. | Tropnikova, Zenkevich, et al., 1999 | Nitrogen, 60. C @ 0. min, 4. K/min, 220. C @ 0. min; Column length: 25. m; Column diameter: 0.20 mm |
Capillary | DB-5 | 1066. | Zoghbi, Andrade, et al., 1999 | 30. m/0.25 mm/0.25 μm, He, 3. K/min; Tstart: 60. C; Tend: 240. C |
Capillary | DB-5 | 1095. | Zoghbi, Andrade, et al., 1999 | 30. m/0.25 mm/0.25 μm, He, 3. K/min; Tstart: 60. C; Tend: 240. C |
Capillary | DB-5MS | 1072. | Zoghbi, Andrade, et al., 1999, 2 | 30. m/0.25 mm/0.25 μm, He, 3. K/min; Tstart: 60. C; Tend: 240. C |
Capillary | DB-5 | 1066. | Maia, Zohhbi, et al., 1998 | 30. m/0.25 mm/0.25 μm, He, 3. K/min; Tstart: 60. C; Tend: 240. C |
Capillary | HP-5 | 1067. | Poiana, Sicari, et al., 1998 | 25. m/0.2 mm/0.33 μm, He, 70. C @ 8. min, 3. K/min, 290. C @ 20. min |
Capillary | HP-1 | 1076. | Stashenko, Cervantes, et al., 1998 | 60. m/0.25 mm/0.25 μm, He, 50. C @ 5. min, 4. K/min; Tend: 280. C |
Capillary | SPB-Sulfur | 1073. | Mariaca, Berger, et al., 1997 | 30. m/0.32 mm/4. μm, He, 45. C @ 13. min, 5. K/min, 240. C @ 5. min |
Capillary | SPB-Sulfur | 1073. | Mariaca, Berger, et al., 1997 | 30. m/0.32 mm/4. μm, He, 45. C @ 13. min, 5. K/min, 240. C @ 5. min |
Capillary | DB-1 | 1066. | Salgueiro, Vila, et al., 1997 | 6. K/min; Tstart: 80. C; Tend: 220. C |
Capillary | DB-1 | 1037. | Salgueiro, Vila, et al., 1997 | 6. K/min; Tstart: 80. C; Tend: 220. C |
Capillary | HP-1 | 1080. | Ayedoun, Adeoti, et al., 1996 | 23. m/0.32 mm/0.17 μm, He, 60. C @ 3. min, 5. K/min, 250. C @ 30. min |
Capillary | HP-1 | 1050. | Ayedoun, Adeoti, et al., 1996 | 23. m/0.32 mm/0.17 μm, He, 60. C @ 3. min, 5. K/min, 250. C @ 30. min |
Capillary | DB-1 | 1102. | Sagrero-Nieves and Bartley, 1996 | 60. m/0.32 mm/0.50 μm, He, 50. C @ 1. min, 8. K/min, 250. C @ 6. min |
Capillary | SPB-1 | 1054. | Wong and Lai, 1996 | 50. m/0.2 mm/0.33 μm, He, 40. C @ 3. min, 3. K/min, 200. C @ 30. min |
Capillary | SPB-1 | 1085. | Wong and Lai, 1996 | 50. m/0.2 mm/0.33 μm, He, 40. C @ 3. min, 3. K/min, 200. C @ 30. min |
Capillary | DB-1 | 1088. | Tirado, Stashenko, et al., 1995 | 60. m/0.25 mm/0.25 μm, He, 70. C @ 5. min, 2.5 K/min; Tend: 270. C |
Capillary | DB-1 | 1088. | Tirado, Stashenko, et al., 1995 | 60. m/0.25 mm/0.25 μm, He, 70. C @ 5. min, 2.5 K/min; Tend: 270. C |
Capillary | DB-1 | 1054. | Tirado, Stashenko, et al., 1995 | 60. m/0.25 mm/0.25 μm, He, 70. C @ 5. min, 2.5 K/min; Tend: 270. C |
Capillary | DB-1 | 1054. | Tirado, Stashenko, et al., 1995 | 60. m/0.25 mm/0.25 μm, He, 70. C @ 5. min, 2.5 K/min; Tend: 270. C |
Capillary | Methyl Silicone | 1060. | Gopalakrishnan, Menon, et al., 1993 | 50. m/0.25 mm/0.17 μm, N2, 2. K/min; Tstart: 80. C; Tend: 200. C |
Capillary | Methyl Silicone | 1057. | Gopalakrishnan, Menon, et al., 1993 | 50. m/0.25 mm/0.17 μm, N2, 3. K/min; Tstart: 80. C; Tend: 200. C |
Capillary | CP Sil 5 CB | 1058. | Kaul, Singh, et al., 1993 | 5. K/min; Column length: 25. m; Column diameter: 0.25 mm; Tstart: 60. C; Tend: 280. C |
Capillary | OV-101 | 1059. | Tamura, Yang, et al., 1993 | 2. K/min; Column length: 50. m; Column diameter: 0.25 mm; Tstart: 80. C; Tend: 200. C |
Capillary | OV-101 | 1059. | Tamura, Yang, et al., 1993 | 2. K/min; Column length: 50. m; Column diameter: 0.25 mm; Tstart: 80. C; Tend: 200. C |
Capillary | SE-54 | 1093. | Kollmannsberger, Nitz, et al., 1992 | 30. m/0.25 mm/0.25 μm, Hydrogen, 60. C @ 5. min, 2. K/min, 250. C @ 2. min |
Capillary | SE-54 | 1066. | Kollmannsberger, Nitz, et al., 1992 | 30. m/0.25 mm/0.25 μm, Hydrogen, 60. C @ 5. min, 2. K/min, 250. C @ 2. min |
Capillary | BP-1 | 1089. | Brophy, Davies, et al., 1989 | H2, 40. C @ 1. min, 10. K/min; Column length: 50. m; Column diameter: 0.30 mm; Tend: 250. C |
Capillary | BP-1 | 1058. | Brophy, Davies, et al., 1989 | H2, 40. C @ 1. min, 10. K/min; Column length: 50. m; Column diameter: 0.30 mm; Tend: 250. C |
Capillary | SE-30 | 1053. | de Pooter, de Buyck, et al., 1989 | 40. m/0.50 mm/0.75 μm, He, 3. K/min; Tstart: 30. C; Tend: 220. C |
Capillary | SE-30 | 1088. | de Pooter, de Buyck, et al., 1989 | 40. m/0.50 mm/0.75 μm, He, 3. K/min; Tstart: 30. C; Tend: 220. C |
Capillary | OV-101 | 1069. | Sugisawa, Yamamoto, et al., 1989 | N2, 2. K/min; Column length: 50. m; Column diameter: 0.25 mm; Tstart: 80. C; Tend: 200. C |
Capillary | OV-101 | 1059. | Sugisawa, Yang, et al., 1989 | N2, 2. K/min; Column length: 50. m; Column diameter: 0.25 mm; Tstart: 80. C; Tend: 200. C |
Capillary | OV-101 | 1060. | Sugisawa, Yang, et al., 1989 | N2, 2. K/min; Column length: 50. m; Column diameter: 0.25 mm; Tstart: 80. C; Tend: 200. C |
Capillary | OV-1 | 1053. | de Pooter, Nicolai, et al., 1988 | 50. m/0.20 mm/0.20 μm, He, 2. K/min; Tstart: 30. C; Tend: 220. C |
Capillary | OV-1 | 1096. | de Pooter, Nicolai, et al., 1988 | 50. m/0.20 mm/0.20 μm, He, 2. K/min; Tstart: 30. C; Tend: 220. C |
Capillary | OV-101 | 1080. | Nykanen, 1986 | 40. C @ 5. min, 3.5 K/min; Column length: 50. m; Column diameter: 0.30 mm; Tend: 230. C |
Capillary | OV-101 | 1088. | Nykanen, 1986 | 40. C @ 5. min, 3.5 K/min; Column length: 50. m; Column diameter: 0.30 mm; Tend: 230. C |
Capillary | OV-101 | 1101. | Nykanen, 1986 | 40. C @ 5. min, 3.5 K/min; Column length: 50. m; Column diameter: 0.30 mm; Tend: 230. C |
Capillary | OV-101 | 1053. | Nykanen, 1986 | 40. C @ 5. min, 3.5 K/min; Column length: 50. m; Column diameter: 0.30 mm; Tend: 230. C |
Capillary | OV-101 | 1060. | Nykanen, 1986 | 40. C @ 5. min, 3.5 K/min; Column length: 50. m; Column diameter: 0.30 mm; Tend: 230. C |
Capillary | OV-101 | 1071. | Nykanen, 1986 | 40. C @ 5. min, 3.5 K/min; Column length: 50. m; Column diameter: 0.30 mm; Tend: 230. C |
Capillary | OV-1 | 1086. | de Pooter, de Buyck, et al., 1986 | 40. m/0.5 mm/0.75 μm, He, 3. K/min; Tstart: 30. C; Tend: 220. C |
Capillary | OV-1 | 1054. | de Pooter, de Buyck, et al., 1986 | 40. m/0.5 mm/0.75 μm, He, 3. K/min; Tstart: 30. C; Tend: 220. C |
Capillary | OV-1 | 1089. | De Pooter, De Buyck, et al., 1986 | He, 2. K/min; Tstart: 40. C; Tend: 220. C |
Capillary | OV-1 | 1056. | De Pooter, De Buyck, et al., 1986 | He, 2. K/min; Tstart: 40. C; Tend: 220. C |

Normal alkane RI, non-polar column, custom temperature program

Column type | Active phase | I | Reference | Comment |
---|---|---|---|---|
Capillary | DB-1-MS | 1098. | Takeoka, Hobbs, et al., 2010 | 60. m/0.25 mm/0.25 μm, Helium; Program: not specified |
Capillary | DB-5 | 1075. | Courtois, Paine, et al., 2009 | 30. m/0.25 mm/0.25 μm, Helium; Program: 50 0C m6 0C/min -> 140 0C 5 0C/min -> 160 0C (1 min) 10 0C/min -> 200 0C |
Capillary | DB-5 | 1108. | Courtois, Paine, et al., 2009 | 30. m/0.25 mm/0.25 μm, Helium; Program: 50 0C m6 0C/min -> 140 0C 5 0C/min -> 160 0C (1 min) 10 0C/min -> 200 0C |
Capillary | DB-1 | 1089. | Delort and Jaquier, 2009 | 60. m/0.25 mm/0.25 μm, Helium; Program: 50 0C (5 min) 3 0C/min -> 120 0C 5 0C/min -> 250 0C (3 min) 15 0C/min -> 300 0C (20 min) |
Capillary | DB-1 | 1061. | Delort and Jaquier, 2009 | 60. m/0.25 mm/0.25 μm, Helium; Program: 50 0C (5 min) 3 0C/min -> 120 0C 5 0C/min -> 250 0C (3 min) 15 0C/min -> 300 0C (20 min) |
Capillary | Elite-5 MS | 1063. | Kapoor, Singh, et al., 2009 | 30. m/0.25 mm/0.25 μm, Helium; Program: 60 0C (1 min) 1.5 0C/min -> 185 0C (1 min) 9 0C/min -> 275 0C (2 min) |
Capillary | Elite-5 MS | 1101. | Kapoor, Singh, et al., 2009 | 30. m/0.25 mm/0.25 μm, Helium; Program: 60 0C (1 min) 1.5 0C/min -> 185 0C (1 min) 9 0C/min -> 275 0C (2 min) |
Capillary | DB-1 | 1066. | Mendes, Trindade, et al., 2009 | 30. m/0.25 mm/0.25 μm, Hydrogen; Program: 45 0C 3 0C/min -> 175 0C 15 0C/min -> 300 0C (10 min) |
Capillary | DB-1 | 1037. | Mendes, Trindade, et al., 2009 | 30. m/0.25 mm/0.25 μm, Hydrogen; Program: 45 0C 3 0C/min -> 175 0C 15 0C/min -> 300 0C (10 min) |
Capillary | DB-1 | 1066. | Mendes, Trindade, et al., 2009, 2 | 30. m/0.25 mm/0.25 μm, Hydrogen; Program: 45 0C 3 0C/min -> 175 0C 15 0C/min -> 300 0C (10 min) |
Capillary | DB-1 | 1037. | Mendes, Trindade, et al., 2009, 2 | 30. m/0.25 mm/0.25 μm, Hydrogen; Program: 45 0C 3 0C/min -> 175 0C 15 0C/min -> 300 0C (10 min) |
Capillary | DB-5 | 1073. | Porto, Decorti, et al., 2009 | 30. m/0.25 mm/0.25 μm, Helium; Program: not specified |
Capillary | DB-5 | 1075. | Porto, Decorti, et al., 2009 | 30. m/0.25 mm/0.25 μm, Helium; Program: not specified |
Capillary | HP-5 | 1068. | Riahi, Pourbasheer, et al., 2009 | Column length: 30. m; Column diameter: 0.32 mm; Program: not specified |
Capillary | HP-5 | 1097. | Riahi, Pourbasheer, et al., 2009 | Column length: 30. m; Column diameter: 0.32 mm; Program: not specified |
Capillary | SLB-5 MS | 1069. | Costa, De Fina, et al., 2008 | 30. m/0.25 mm/0.25 μm, Helium; Program: 50 0C 3 0C/min -> 250 0C (1 min) 10 0C/min -> 300 0C (5 min) |
Capillary | SLB-5 MS | 1065. | Costa, De Fina, et al., 2008 | 30. m/0.25 mm/0.25 μm, Helium; Program: not specified |
Capillary | SLB-5 MS | 1069. | Lo Presti, Sciarrone, et al., 2008 | 30. m/0.25 mm/0.25 μm, Helium; Program: not specified |
Capillary | DB-1 | 1066. | Ferreira, Meireles de Sousa, et al., 2007 | 30. m/0.25 mm/0.25 μm, He; Program: 45C => 3C/min => 175C => 15C/min => 300C (10min) |
Capillary | DB-1 | 1037. | Ferreira, Meireles de Sousa, et al., 2007 | 30. m/0.25 mm/0.25 μm, He; Program: 45C => 3C/min => 175C => 15C/min => 300C (10min) |
Capillary | CP Sil 8 CB | 1098. | Radusiene, Judzentiene, et al., 2007 | 50. m/0.32 mm/0.25 μm, Helium; Program: 60 0C (2 min) 5 0C/min -> 160 0C (1 min) 10 0C/min -> 280 0C (3 min) |
Capillary | Polydimethyl siloxane | 1066. | Werka, Boehme, et al., 2007 | Program: not specified |
Capillary | Polydimethyl siloxane | 1097. | Werka, Boehme, et al., 2007 | Program: not specified |
Capillary | BPX-5 | 1083. | Baris, Güllüce, et al., 2006 | 30. m/0.25 mm/0.25 μm, He; Program: 50C => 3C/min => 150C(10min) => 10C/min => 250C |
Capillary | SPB-5 | 1058. | Chemat, Lucchesi, et al., 2006 | 60. m/0.32 mm/1. μm, He; Program: 60C => 1C/min => 130C => 2C/min => 200C => 4C/min => 250C (40min) |
Capillary | DB-1 | 1037. | Figueiredo A.C., Barroso J.G., et al., 2006 | 30. m/0.25 mm/0.25 μm, He; Program: 45C => 3C/min => 175C => 15C/min => 300C (10min) |
Capillary | SPB-5 | 1058. | Iriti, Colnaghi, et al., 2006 | 60. m/0.32 mm/1. μm, He; Program: 60C => 1C/min => 130C => 2C/min => 200C => 4C/min => 250C(40min) |
Capillary | CP Sil 8 CB | 1070. | Judzentiene and Buzelyte, 2006 | 50. m/0.32 mm/0.25 μm, He; Program: 60C(2min) => 5C/min => 160C(1min) => 10C/min => 250C (5min) |
Capillary | CP Sil 8 CB | 1098. | Judzentiene and Buzelyte, 2006 | 50. m/0.32 mm/0.25 μm, He; Program: 60C(2min) => 5C/min => 160C(1min) => 10C/min => 250C (5min) |
Capillary | HP-5 | 1116. | Martinez, Madrid, et al., 2006 | 30. m/0.25 mm/0.25 μm; Program: not specified |
Capillary | CP Sil 8 CB | 1070. | Mockute, Bernotiene, et al., 2006 | 50. m/0.32 mm/0.25 μm, He; Program: 60 0C (2 min) 5 0C/min -> 160 0C 10 0C/min -> 250 0C (5 min) |
Capillary | DB-5 | 1071. | Srivastava, Mallavarapu, et al., 2006 | 30. m/0.32 mm/0.25 μm, He; Program: 60C => 2C/min => 100C => 3C/min => 160C => 5C/min => 280C |
Capillary | SE-52 | 1070. | Tognolini, Barocelli, et al., 2006 | 30. m/0.32 mm/0.15 μm, He; Program: 45C => 1C/min => 100C => 5C/min => 250C (10min) |
Capillary | SE-52 | 1098. | Tognolini, Barocelli, et al., 2006 | 30. m/0.32 mm/0.15 μm, He; Program: 45C => 1C/min => 100C => 5C/min => 250C (10min) |
Capillary | DB-1 | 1098. | Al-Burtamani, Fatope, et al., 2005 | 30. m/0.25 mm/0.25 μm, He; Program: 35C => 2C/min => 200C => 5C/min => 240C |
Capillary | DB-5MS | 1073. | Bagci and Baser, 2005 | 30. m/0.25 mm/0.25 μm; Program: 70C(2min) => 10C/min => 150C(15min) => 5C/min => 240C |
Capillary | DB-5MS | 1101. | Bagci and Baser, 2005 | 30. m/0.25 mm/0.25 μm; Program: 70C(2min) => 10C/min => 150C(15min) => 5C/min => 240C |
Capillary | CP Sil 8 CB | 1068. | Butkienë, Nivinskienë, et al., 2005 | 50. m/0.32 mm/0.25 μm, He; Program: 50C(5min) => 2C/min => 90C => 15C/min => 240C(4min) |
Capillary | CP Sil 8 CB | 1097. | Butkienë, Nivinskienë, et al., 2005 | 50. m/0.32 mm/0.25 μm, He; Program: 50C(5min) => 2C/min => 90C => 15C/min => 240C(4min) |
Capillary | DB-1 | 1037. | Faleio, Miguel, et al., 2005 | 30. m/0.25 mm/0.25 μm, He; Program: 45C => 3C/min => 175C => 15C/min => 300C (10min) |
Capillary | DB-1 | 1066. | Figueiredo, Sim-Sim, et al., 2005 | 30. m/0.25 mm/0.25 μm, He; Program: 45C => 3C/min => 175C => 15C/min => 300C (10min) |
Capillary | DB-1 | 1037. | Figueiredo, Sim-Sim, et al., 2005 | 30. m/0.25 mm/0.25 μm, He; Program: 45C => 3C/min => 175C => 15C/min => 300C (10min) |
Capillary | HP-5MS | 1096. | Novak, Draxler, et al., 2005 | 30. m/0.25 mm/0.25 μm; Program: 40C(5min) => 3C/min => 90C => 10C/min => 280C |
Capillary | HP-5MS | 1067. | Novak, Draxler, et al., 2005 | 30. m/0.25 mm/0.25 μm; Program: 40C(5min) => 3C/min => 90C => 10C/min => 280C |
Capillary | DB-1 | 1097. | Omidbaigi and Bastan, 2005 | Program: not specified |
Capillary | DB-1 | 1068. | Omidbaigi and Bastan, 2005 | Program: not specified |
Capillary | CP Sil 8 CB | 1070. | Radudienë, Judpintienë, et al., 2005 | 50. m/0.32 mm/0.25 μm, He; Program: 60C(2min) => 5C/min => 160C(1min) => 10C/min => 250C (3min) |
Capillary | CP Sil 8 CB | 1098. | Radudienë, Judpintienë, et al., 2005 | 50. m/0.32 mm/0.25 μm, He; Program: 60C(2min) => 5C/min => 160C(1min) => 10C/min => 250C (3min) |
Capillary | HP-5 | 1069. | Singh, Maurya, et al., 2005 | Column length: 30. m; Column diameter: 0.32 mm; Program: 65C(1min) => 1C/min => 75C (2min) => 0.5C/min => 81C(2min) => 3C/min => 180C(7min) |
Capillary | DB-5 | 1055. | Albuquerque, Souza, et al., 2004 | 30. m/0.25 mm/0.1 μm, He; Program: 35C => 4C/min => 180C => 10C/min => 250C |
Capillary | DB-5 | 1080. | Albuquerque, Souza, et al., 2004 | 30. m/0.25 mm/0.1 μm, He; Program: 35C => 4C/min => 180C => 10C/min => 250C |
Capillary | CP Sil 8 CB | 1068. | Judpentienë and Mockutë, 2004 | 50. m/0.32 mm/0.25 μm, He; Program: 60C(2min) => 5C/min => 160C(1min) => 10C/min => 250C (5min) |
Capillary | CP Sil 8 CB | 1097. | Judpentienë and Mockutë, 2004 | 50. m/0.32 mm/0.25 μm, He; Program: 60C(2min) => 5C/min => 160C(1min) => 10C/min => 250C (5min) |
Capillary | BPX-5 | 1070. | Koba, Sanda, et al., 2004 | 30. m/0.25 mm/0.25 μm, H2; Program: 50 0C (1 min) 3 0C/min -> 150 0C 5 0C/min -> 250 0C (5 min) |
Capillary | DB-1 | 1066. | Miguel, Simões, et al., 2004 | 30. m/0.25 mm/0.25 μm, He; Program: 45C => 3C/min => 175C => 15C/min => 300C (10min) |
Capillary | DB-1 | 1037. | Miguel, Simões, et al., 2004 | 30. m/0.25 mm/0.25 μm, He; Program: 45C => 3C/min => 175C => 15C/min => 300C (10min) |
Capillary | CP Sil 8 CB | 1068. | Mockutë, Bernotienë, et al., 2004 | He; Column length: 50. m; Column diameter: 0.32 mm; Program: 50 0C (2 min) 3 0C/min -> 180 0C (1 min) 20 0C/min -> 250 0C (2 min) |
Capillary | CP Sil 8 CB | 1096. | Mockutë, Bernotienë, et al., 2004 | He; Column length: 50. m; Column diameter: 0.32 mm; Program: 50 0C (2 min) 3 0C/min -> 180 0C (1 min) 20 0C/min -> 250 0C (2 min) |
Capillary | CP Sil 8 CB | 1068. | Mockutë, Judbentienë, et al., 2004 | 50. m/0.32 mm/0.25 μm, He; Program: 50C(2min) => 3C/min => 180C(1min) => 20C/min => 250C (2min) |
Capillary | HP-5MS | 1070. | Sahin, Gulluce, et al., 2004 | 30. m/0.25 mm/0.25 μm, He; Program: 50C(3min) => 3C/min => 150C(10min) => 10C/min => 250C |
Capillary | HP-5MS | 1070. | Singh, Marimuthu, et al., 2004 | 30. m/0.25 mm/0.25 μm; Program: 60C(1min) => 1.5C/min => 185C(1min) => 9C/min => 275C(2min) |
Capillary | HP-5MS | 1098. | Singh, Marimuthu, et al., 2004 | 30. m/0.25 mm/0.25 μm; Program: 60C(1min) => 1.5C/min => 185C(1min) => 9C/min => 275C(2min) |
Capillary | HP-5MS | 1098. | Singh, Maurya, et al., 2004 | 30. m/0.25 mm/0.25 μm, He; Program: 60C(1min) => 0.5C/min => 85C(1min) => 1C/min => 105C (2min) => 10C/min => 275C(2min) |
Capillary | HP-5 | 1070. | Tepe, Donmez, et al., 2004 | 30. m/0.25 mm/0.25 μm, He; Program: 50C (3min) => 3C/min => 150C (10min) => 10C/min => 250C |
Capillary | DB-1 | 1037. | Touafek, Nacer, et al., 2004 | 30. m/0.25 mm/0.25 μm, He; Program: 45C => 3C/min => 175C => 15C/min => 300C (15min) |
Capillary | SE-30 | 1090. | Vinogradov, 2004 | Program: not specified |
Capillary | SE-30 | 1052. | Vinogradov, 2004 | Program: not specified |
Capillary | CP-Sil 8CB-MS | 1068. | Mockute, Bernotiene, et al., 2003 | He; Column length: 50. m; Column diameter: 0.32 mm; Program: 50C(2min) => 3C/min => 180C(1min) => 20C/min => 250C(2min) |
Capillary | CP-Sil 8CB-MS | 1096. | Mockute, Bernotiene, et al., 2003 | He; Column length: 50. m; Column diameter: 0.32 mm; Program: 50C(2min) => 3C/min => 180C(1min) => 20C/min => 250C(2min) |
Capillary | CP Sil 8 CB | 1068. | Mockute and Judzentiene, 2003 | 50. m/0.32 mm/0.25 μm, He; Program: 70C(5min) => 3C/min => 100C (1min) => 25C/min => 250C (10min) |
Capillary | CP Sil 8 CB | 1097. | Mockute and Judzentiene, 2003 | 50. m/0.32 mm/0.25 μm, He; Program: 70C(5min) => 3C/min => 100C (1min) => 25C/min => 250C (10min) |
Capillary | AT-5 | 1068. | Usai, Atzei, et al., 2003 | 60. m/0.25 mm/0.25 μm, He; Program: 50 0C 5 0C/min -> 135 0C (1 min) 5 0C/min -> 225 0C (5 min) 5 0C/min -> 260 0C |
Capillary | SE-54 | 1071. | Kilic, 2002 | Program: not specified |
Capillary | HP-1 | 1073. | Nogueira and Romano, 2002 | 30. m/0.32 mm/0.25 μm, He; Program: 40C(3min) => 5C/min => 180C => 15C/min => 240C(15min) |
Capillary | HP-5 | 1062. | Aparicio, Romero, et al., 2001 | 30. m/0.25 mm/0.25 μm; Program: not specified |
Capillary | DB-1 | 1066. | Figueiredo, Miguel, et al., 2001 | 30. m/0.25 mm/0.25 μm; Program: 45 0C 3 K/min -> 175 0C 15 K/min -> 300 0C (10 min) |
Capillary | DB-1 | 1037. | Figueiredo, Miguel, et al., 2001 | 30. m/0.25 mm/0.25 μm; Program: 45 0C 3 K/min -> 175 0C 15 K/min -> 300 0C (10 min) |
Capillary | DB-1 | 1066. | Dorman, Figueiredo, et al., 2000 | 30. m/0.25 mm/0.25 μm, H2; Program: 40 0C 3 K/min -> 175 0C 15 K/min -> 240 0C (10 min) |
Capillary | DB-1 | 1037. | Dorman, Figueiredo, et al., 2000 | 30. m/0.25 mm/0.25 μm, H2; Program: 40 0C 3 K/min -> 175 0C 15 K/min -> 240 0C (10 min) |
Capillary | DB-1 | 1047. | Kéita, Vincent, et al., 2000 | 30. m/0.25 mm/0.25 μm, He; Program: not specified |
Capillary | DB-1 | 1049. | Kéita, Vincent, et al., 2000 | 30. m/0.25 mm/0.25 μm, He; Program: not specified |
Capillary | SE-30 | 1060. | Prikhod'ko, Klyuev, et al., 1999 | 30. m/0.25 mm/0.20 μm, Helium; Program: not specified |
Capillary | CP Sil 5 CB | 1082. | Weyerstahl, Marschall, et al., 1999, 2 | Column length: 25. m; Column diameter: 0.39 mm; Program: not specified |
Capillary | CP Sil 5 CB | 1057. | Weyerstahl, Marschall, et al., 1999, 2 | Column length: 25. m; Column diameter: 0.39 mm; Program: not specified |
Capillary | DB-1 | 1066. | Baratta, Dorman, et al., 1998 | 30. m/0.25 mm/0.25 μm, He; Program: 45C => 3C/min => 175C => 15C/min => 240C (10min) |
Capillary | DB-1 | 1037. | Baratta, Dorman, et al., 1998 | 30. m/0.25 mm/0.25 μm, He; Program: 45C => 3C/min => 175C => 15C/min => 240C (10min) |
Capillary | DB-5 | 1109. | Sanda, Koba, et al., 1998 | 30. m/0.25 mm/0.25 μm, N2; Program: 45C(5min) => 2C/min => 200C => 5C/min => 250C |
Capillary | DB-5 | 1068. | Yusuf, Begum, et al., 1998 | 30. m/0.25 mm/0.25 μm, He; Program: 60C => 3C/min => 240C => 30C/min => 300C |
Capillary | SPB-Sulfur | 1060. | Mariaca, Berger, et al., 1997 | 30. m/0.32 mm/4. μm, He; Program: not specified |
Capillary | CP Sil 5 CB | 1089. | Weyerstahl, Marschall, et al., 1997 | N2; Column length: 30. m; Column diameter: 0.25 mm; Program: not specified |
Capillary | CP Sil 5 CB | 1059. | Weyerstahl, Marschall, et al., 1997 | N2; Column length: 30. m; Column diameter: 0.25 mm; Program: not specified |
Capillary | Polydimethyl siloxanes | 1056. | Zenkevich, 1997 | Program: not specified |
Capillary | 5 % Phenyl methyl siloxane | 1059. | Sagrero-Nieves and Bartley, 1995 | Program: not specified |
Capillary | OV-1 | 1097. | De Pooter and Schamp, 1987 | 35. m/0.50 mm/1.5 μm; Program: not specified |
Capillary | OV-1 | 1053. | De Pooter and Schamp, 1987 | 35. m/0.50 mm/1.5 μm; Program: not specified |

Normal alkane RI, polar column, temperature ramp

Column type | Active phase | I | Reference | Comment |
---|---|---|---|---|
Capillary | RTX-Wax | 1440. | Museli, Pau, et al., 2009 | 60. m/0.22 mm/0.25 μm, Helium, 2. K/min, 230. C @ 30. min; Tstart: 60. C |
Capillary | HP-Innowax | 1466. | Cheraif, Ben Jannet, et al., 2007 | 30. m/0.25 mm/0.25 μm, N2, 50. C @ 1. min, 5. K/min, 240. C @ 4. min |
Capillary | PEG-20M | 1463. | Gil A., Van Baren C.M., et al., 2007 | 60. m/0.25 mm/0.25 μm, He, 3. K/min, 225. C @ 15. min; Tstart: 90. C |
Capillary | HP-Innowax | 1450. | Hachicha, Skanji, et al., 2007 | 30. m/0.25 mm/0.25 μm, He, 2. K/min, 240. C @ 20. min; Tstart: 60. C |
Capillary | Supelcowax-10 | 1464. | Pinto, Salgueiro, et al., 2007 | 30. m/0.2 mm/0.2 μm, He, 3. K/min, 220. C @ 15. min; Tstart: 70. C |
Capillary | AT-Wax | 1458. | Borges, Rojas, et al., 2006 | 60. m/0.25 mm/0.25 μm, He, 4. K/min, 200. C @ 20. min; Tstart: 60. C |
Capillary | BP-20 | 1454. | Fanciullino, Tomi, et al., 2006 | 50. m/0.22 mm/0.25 μm, He, 2. K/min, 220. C @ 20. min; Tstart: 60. C |
Capillary | DB-Wax | 1467. | Lan Phi N.T., Nishiyama C., et al., 2006 | 60. m/0.25 mm/0.25 μm, 70. C @ 2. min, 2. K/min, 230. C @ 20. min |
Capillary | DB-Wax | 1463. | Lee, Umano, et al., 2005 | 30. m/0.25 mm/0.25 μm, He, 3. K/min, 180. C @ 40. min; Tstart: 50. C |
Capillary | DB-Wax | 1489. | Qian and Wang, 2005 | 60. m/0.32 mm/0.50 μm, Nitrogen, 35. C @ 4. min, 2. K/min, 235. C @ 30. min |
Capillary | DB-Wax | 1463. | Choi, 2004 | 60. m/0.25 mm/0.25 μm, N2, 70. C @ 2. min, 2. K/min, 230. C @ 20. min |
Capillary | Supelcowax-10 | 1460. | Orav, Stulova, et al., 2004 | 50. m/0.2 mm/0.25 μm, He, 2. K/min; Tstart: 70. C; Tend: 230. C |
Capillary | Supelcowax-10 | 1460. | Orav, Stulova, et al., 2004 | 50. m/0.2 mm/0.25 μm, He, 2. K/min; Tstart: 70. C; Tend: 230. C |
Capillary | SW-10 | 1460. | Raal, Paaver, et al., 2004 | 50. m/0.20 mm/0.25 μm, He, 2. K/min; Tstart: 50. C; Tend: 230. C |
Capillary | Supelcowax-10 | 1467. | Cabanillas, Lopez, et al., 2003 | 30. m/0.25 mm/0.25 μm, He, 4. K/min; Tstart: 60. C; Tend: 240. C |
Capillary | DB-Wax | 1467. | Mookdasanit, Tamura, et al., 2003 | Helium, 2. K/min, 210. C @ 60. min; Column length: 60. m; Column diameter: 0.25 mm; Tstart: 70. C |
Capillary | Innowax | 1474. | Suleimenov, Atazharova, et al., 2003 | He, 60. C @ 10. min, 4. K/min, 220. C @ 10. min; Column length: 60. m; Column diameter: 0.25 mm |
Capillary | DB-Wax | 1453. | Tu, Onishi, et al., 2003 | 60. m/0.25 mm/0.25 μm, N2, 70. C @ 2. min, 2. K/min, 230. C @ 20. min |
Capillary | DB-Wax | 1459. | Umano, Hagi, et al., 2002 | 60. m/0.25 mm/0.25 μm, He, 40. C @ 2. min, 2. K/min; Tend: 200. C |
Capillary | BP-20 | 1458. | Lota, de Rocca Serra, et al., 2001 | 50. m/0.22 mm/0.25 μm, He, 2. K/min, 230. C @ 35. min; Tstart: 60. C |
Capillary | PEG-20M | 1461. | Orav and Kann, 2001 | He, 2. K/min; Column length: 50. m; Column diameter: 0.2 mm; Tstart: 70. C; Tend: 220. C |
Capillary | Supelcowax-10 | 1470. | Korány, Mednyánszky, et al., 2000 | 60. m/0.25 mm/0.25 μm, He, 4. K/min; Tstart: 60. C; Tend: 280. C |
Capillary | BP-20 | 1470. | Mallavarapu, Rao, et al., 2000 | 25. m/0.50 mm/0.25 μm, Nitrogen, 5. K/min; Tstart: 60. C; Tend: 200. C |
Capillary | DB-Wax | 1467. | Umano, Hagi, et al., 2000 | 60. m/0.25 mm/0.25 μm, He, 40. C @ 2. min, 2. K/min; Tend: 200. C |
Capillary | Supelcowax-10 | 1467. | Labuckas, Zygadlo, et al., 1999 | He, 4. K/min; Column length: 30. m; Column diameter: 0.25 mm; Tstart: 60. C; Tend: 240. C |
Capillary | DB-Wax | 1464. | Ngassoum, Yonkeu, et al., 1999 | 60. m/0.25 mm/0.25 μm, He, 4. K/min; Tstart: 60. C; Tend: 240. C |
Capillary | BP-20 | 1465. | Rao, Bhattacharya, et al., 1999 | N2, 5. K/min; Column length: 25. m; Column diameter: 0.5 mm; Tstart: 60. C; Tend: 200. C |
Capillary | BP-20 | 1476. | Bignell, Dunlop, et al., 1998 | 25. m/0.33 mm/0.5 μm, H2, 5. K/min; Tstart: 80. C; Tend: 220. C |
Capillary | HP-Innowax | 1444. | Stashenko, Cervantes, et al., 1998 | 60. m/0.25 mm/0.25 μm, He, 50. C @ 5. min, 5. K/min; Tend: 220. C |
Capillary | HP-Innowax FSC | 1474. | Tümen, Baser, et al., 1998 | 60. m/0.25 mm/0.25 μm, He, 60. C @ 10. min, 4. K/min, 220. C @ 10. min |
Capillary | HP-Innowax FSC | 1474. | Baser, Kirimer, et al., 1997 | He, 60. C @ 10. min, 4. K/min, 240. C @ 10. min; Column length: 60. m; Column diameter: 0.25 mm |
Capillary | Supelcowax-10 | 1467. | Wong and Lai, 1996 | 60. m/0.25 mm/0.25 μm, He, 40. C @ 3. min, 3. K/min, 200. C @ 30. min |
Capillary | Carbowax 20M | 1463. | Tirado, Stashenko, et al., 1995 | 60. m/0.25 mm/0.25 μm, He, 50. C @ 10. min, 2. K/min, 150. C @ 20. min |
Capillary | Carbowax 20M | 1464. | Kollmannsberger, Nitz, et al., 1992 | 45. m/0.32 mm/1.0 μm, Hydrogen, 60. C @ 5. min, 2. K/min; Tend: 200. C |
Capillary | FFAP | 1484. | Brophy, Davies, et al., 1989 | 50. C @ 1. min, 10. K/min; Column length: 50. m; Tend: 180. C |
Capillary | Carbowax 20M | 1462. | Nykanen, 1986 | 40. C @ 5. min, 2. K/min; Column length: 25. m; Column diameter: 0.30 mm; Tend: 220. C |

Normal alkane RI, polar column, custom temperature program

Column type | Active phase | I | Reference | Comment |
---|---|---|---|---|
Capillary | Carbowax 20M | 1462. | Hudaib and Aburjai, 2007 | 30. m/0.25 mm/0.25 μm, He; Program: not specified |
Capillary | Innowax FSC | 1474. | Kaya, Benirci, et al., 2007 | 60. m/0.25 mm/0.25 μm, Nitrogen; Program: 60 0C (10 min) 1 0C/min -> 220 0C (10 min) 1 0C/min -> 240 0C |
Capillary | Innowax FSC | 1474. | Tabanca, Demirci, et al., 2007 | 60. m/0.25 mm/0.25 μm, He; Program: 60C(10min) => 4C/min => 220C (10min) => 1C/min => 240C |
Capillary | HP Innowax FSP | 1474. | Tabanca N., Demirci B., et al., 2007 | 60. m/0.25 mm/0.25 μm, N2; Program: 60C(10min) => 4C/min => 220C(10min) => 1C/min => 240C |
Capillary | HP-Innowax FSC | 1474. | Demirci B., Baser K.H.C., et al., 2006 | 60. m/0.25 mm/0.25 μm, N2; Program: 60C(10min) => 4C/min => 220C(10min) => 1C/min => 240C |
Capillary | Innowax FSC | 1474. | Iscan, Kirimer, et al., 2006 | 60. m/0.25 mm/0.25 μm, N2; Program: 60C(10min) => 4C/min => 220C(10min) => 1C/min => 240C |
Capillary | HP-Innowax FSC | 1474. | Kürkçüoglu, Hüsnü Can Baser, et al., 2006 | 60. m/0.25 mm/0.25 μm, He; Program: 60C(10min) => 4C/min => 220C (10min) => 1C/min => 240C |
Capillary | HP-Innowax FSC | 1474. | Suleimenov Y.M., Atazhanova G.A., et al., 2006 | 60. m/0.25 mm/0.25 μm, He; Program: 60(10min) => 4C/min => 220C(10min) => 1C/min => 240C |
Capillary | HP-Innowax FSC | 1474. | Tabanca, Demirci, et al., 2006 | 60. m/0.25 mm/0.25 μm, N2; Program: 60C(10min) => 4C/min => 220C => (10min) => 1C/min => 240C |
Capillary | HP-Innowax FSC | 1474. | Demirci, Demirci, et al., 2005 | 60. m/0.25 mm/0.25 μm, N2; Program: 60C(10min) => 4C/min => 220C (10min) => 1C/min => 240C |
Capillary | Innowax FSC | 1474. | Kosar, Özek, et al., 2005 | 60. m/0.25 mm/0.25 μm, He; Program: 60C(10min) => 4C/min => 220C(10min) => 1C/min => 240C |
Capillary | HP-Innowax FSC | 1474. | Tabanca, Demirci, et al., 2005 | 60. m/0.25 mm/0.25 μm, He; Program: 60C(10min) => 4C/min => 220C(10min) => 1C/min => 240C |
Capillary | HP-Innowax FSC | 1474. | Demirci, Paper, et al., 2004 | 60. m/0.25 mm/0.25 μm, He; Program: 60C(10min) => 4C/min => 220C(10min) => 1C/min => 240C |
Capillary | Carbowax 20M | 1456. | Vinogradov, 2004 | Program: not specified |
Capillary | Carbowax 20M | 1465. | Vinogradov, 2004 | Program: not specified |
Capillary | Innowax FSC | 1474. | Baser, Demirci, et al., 2003 | 60. m/0.25 mm/0.25 μm, He; Program: 60C(10min) => 4C/min => 220C (10min) => 1C/min => 240C |
Capillary | HP-Innowax FSC | 1474. | Demirci, Baser, et al., 2003 | 60. m/0.25 mm/0.25 μm, He; Program: 60C (10min) => 4C/min => 220C (10min) => 1C/min => 240C |
Capillary | Carbowax | 1466. | Edris, Shalaby, et al., 2003 | Program: not specified |
Capillary | HP-Innowax FSC | 1474. | Kaya, Demirci, et al., 2003 | 60. m/0.25 mm/0.25 μm, N2; Program: 60C(10min) => 4C/min => 220C(10min) => 1C/min => 240C |
Capillary | HP-Innowax FSC | 1474. | Kürkcüoglu, Demirci, et al., 2003 | 60. m/0.25 mm/0.25 μm, He; Program: 60C(10min) => 4C/min => 220C(10min) => 1C/min => 240C(40min) |
Capillary | HP-Innowax | 1474. | Viljoen, van Vuuren, et al., 2003 | 60. m/0.25 mm/0.25 μm; Program: 60C(10min) => 4C/min => 220C(10min) => 1C/min => 240C |
Capillary | HP-Innowax | 1474. | Baser, Demirci, et al., 2002 | 60. m/0.25 mm/0.25 μm, He; Program: 60 0C (10 min) 4 K/min -> 220 0C (10 min) 1 K/min -> 240 0C |
Capillary | Innowax | 1474. | Baser, Nuriddinov, et al., 2002 | 60. m/0.25 mm/0.25 μm, He; Program: 60C(10min) => 4C/min => 220C(10min) => 1C/min => 240C |
Capillary | HP-Innowax | 1474. | Demirci, Baser, et al., 2002 | 60. m/0.25 mm/0.25 μm, He; Program: 60 0C (10 min) 4 K/min -> 220 0C (10 min) 1 K/min -> 240 0C |
Capillary | HP-Innowax FSC | 1474. | Hüsnü Can Baser, Demirci, et al., 2002 | 60. m/0.25 mm/0.25 μm, N2; Program: 60C(10min) => 4C/min => 220C(10min) => 1C/min => 240C |
Capillary | Innowax FSC | 1474. | Tunalier, Kirimer, et al., 2002 | 60. m/0.25 mm/0.25 μm; Program: 60C(10min) => 4C/min => 220C(10min) => 1C/min => 240C |
Capillary | HP-Innowax | 1474. | Baser, Demirci, et al., 2001 | 60. m/0.25 mm/0.25 μm, He; Program: 60 0C (10 min) 10 K/min -> 220 0C (10 min) 1K/min -> 240 0C |
Capillary | HP-Innowax | 1474. | Gören, Demirci, et al., 2001 | 60. m/0.25 mm/0.25 μm, He; Program: 60 0C (10 min) 4 K/min -> 220 0C (10 min) 1 K/min -> 240 0C |
Capillary | HP-Innowax FSC | 1474. | Kirimer N., Tabanea N., et al., 2001 | 60. m/0.25 mm/0.25 μm, He; Program: 60C(10min) => 4C/min => 220C(10min) => 1C/min => 240C |
Capillary | Innowax | 1474. | Özcan, Akgül, et al., 2001 | 60. m/0.25 mm/0.25 μm, He; Program: 60C(10min) => 4C/min => 200C(10min) => 1C/min => 240C |
Capillary | Innowax FSC | 1474. | Saglam, Gozler, et al., 2001 | 60. m/0.25 mm/0.25 μm, He; Program: 60C(10min) => 4C/min => 220C(10min) => 1C/min => 240C |
Capillary | HP-Innowax FSC | 1474. | Tabanca, Kirimer, et al., 2001 | 60. m/0.25 mm/0.25 μm; Program: 60C(10min) => 4C/min => 220C(10min) => 1C/min => 240C |
Capillary | HP-Innowax | 1474. | Tabanca, Kirimer, et al., 2001, 2 | 60. m/0.25 mm/0.25 μm, He; Program: 60C(10min) => 4C/min => 220C(10min) => 1C/min => 240C |
Capillary | Innowax | 1474. | Baser, Tabanca, et al., 2000 | 60. m/0.25 mm/0.25 μm, He; Program: 60 0C (10 min) 4 K/min -> 220 0C (10 min) 1 K/min -> 240 0C |
Capillary | RTX-Wax | 1434. | Kéita, Vincent, et al., 2000 | 30. m/0.25 mm/0.25 μm, He; Program: not specified |
Capillary | Innowax FSC | 1474. | Kirimer, Tabanca, et al., 2000 | 60. m/0.25 mm/0.25 μm, He; Program: 60C(10 min) => 4C/min => 220C(10min) => 1C/min => 240C |
Capillary | Innowax FSC | 1474. | Kirimer, Tabanca, et al., 1999 | 60. m/0.25 mm/0.25 μm, Helium; Program: 60 0C (10 min) 4 0C/min -> 220 0C (10 min) 1 0C/min -> 240 0C |
Capillary | Innowax | 1474. | Baser, Kürkcüoglu, et al., 1998 | 60. m/0.25 mm/0.25 μm; Program: 60C(10min) => 4C/min => 220C(10min) => 1C/min => 240C |
Capillary | Carbowax 20M | 1463. | Tirado, Stashenko, et al., 1995 | 60. m/0.25 mm/0.25 μm, He; Program: not specified |

References

Harangi, 2003
Harangi, J.,
Short communication. Retention index calculation without n-alkanes -- the virtual carbon number,
J. Chromatogr. A, 2003, 993, 1-2, 187-195, https://doi.org/10.1016/S0021-9673(03)00320-0
. [all data]
Tarján, Bitter, et al., 2002
Tarján, G.; Bitter, I.; Strasser, B.; Szatmáry, M.,
Data for the gas-liquid chromatographic analysis of essential oils. Determination of the composition of the essential oil of marjoram,
Chromatographia Sup., 2002, 56, 1, s155-s163, https://doi.org/10.1007/BF02494130
. [all data]
Adams, González Elizondo, et al., 2006
Adams, R.P.; González Elizondo, M.S.; González Elizondo, M.; Slinkman, E.,
DNA fingerprinting and terpenoid analysis of Juniperus blancoi var. huehuentensis (Cupressaceae), a new subalpine variety from Durango, Mexico,
Biochem. Syst. Ecol., 2006, 34, 3, 205-211, https://doi.org/10.1016/j.bse.2005.11.004
. [all data]
Hazzit, Baaliouamer, et al., 2006
Hazzit, M.; Baaliouamer, A.; Faleiro, M.L.; Miguel, M.G.,
Composition of the Essential Oils of Thymus and Origanum Species from Algeria and Their Antioxidant and Antimicrobial Activities,
J. Agric. Food Chem., 2006, 54, 17, 6314-6321, https://doi.org/10.1021/jf0606104
. [all data]
Lucero, Fredrickson, et al., 2006
Lucero, M.E.; Fredrickson, E.L.; Estell, R.E.; Morrison, A.A.; Richman, D.B.,
Volatile Composition of Gutierrezia sarothrae (Broom Snakeweed) as Determined by Steam Distillation and Solid Phase Microextraction,
J. Essent. Oil Res., 2006, 18, 2, 121-125, https://doi.org/10.1080/10412905.2006.9699039
. [all data]
Raina, Verma, et al., 2006
Raina, V.K.; Verma, S.C.; Dhawan, S.; Khan, M.; Ramesh, S.; Singh, S.C.; Yadav, A.; Srivastava, S.K.,
Essential oil composition of Murraya exotica from the plains of northern India,
Flavour Fragr. J., 2006, 21, 1, 140-142, https://doi.org/10.1002/ffj.1547
. [all data]
Adams, Morris, et al., 2005
Adams, R.P.; Morris, J.A.; Pandey, R.N.; Schwarzbach, A.E.,
Cryptic speciation between Juniperus deltoides and Juniperus oxycedrus (Cupressaceae) in the Mediterranean,
Biochem. Syst. Ecol., 2005, 33, 8, 771-787, https://doi.org/10.1016/j.bse.2005.01.001
. [all data]
Adams and Nguyen, 2005
Adams, R.P.; Nguyen, S.,
Infra-specific variation in Juniperus deppeana and F. Sperryi in the Davis Mountains of Texas: variation in leaf essential oils and random amplified polymorphic DNAS (RAPDS),
Phytologia, 2005, 87, 2, 96-108. [all data]
Asuming, Beauchamp, et al., 2005
Asuming, W.A.; Beauchamp, P.S.; Descalzo, J.T.; Dev, B.C.; Dev, V.; Frost, S.; Ma, C.W.,
Essential oil composition of four Lomatium Raf. species and their chemotaxonomy,
Biochem. Syst. Ecol., 2005, 33, 1, 17-26, https://doi.org/10.1016/j.bse.2004.06.005
. [all data]
Baranauskiene, Venskutonis, et al., 2005
Baranauskiene, R.; Venskutonis, R.P.; Demyttenaere, J.C.R.,
Sensory and instrumental evaluation of sweet marjoram (Origanum majorana L.) aroma,
Flavour Fragr. J., 2005, 20, 5, 492-500, https://doi.org/10.1002/ffj.1478
. [all data]
Medina, Lucero, et al., 2005
Medina, A.L.; Lucero, M.E.; Holguin, F.O.; Estell, R.E.; Posakony, J.J.; Simon, J.; O'Connell, M.A.,
Composition and antimicrobial activity of Anemopsis californica leaf oil,
J. Agric. Food Chem., 2005, 53, 22, 8694-8698, https://doi.org/10.1021/jf0511244
. [all data]
Tepe, Sokmen, et al., 2005
Tepe, B.; Sokmen, M.; Sokmen, A.; Daferera, D.; Polissiou, M.,
Antimicrobial and antioxidative activity of the essential oil and various extracts of Cyclotrichium origanifolium (Labill.) Manden. Scheng.,
J. Food Eng., 2005, 69, 3, 335-342, https://doi.org/10.1016/j.jfoodeng.2004.08.024
. [all data]
Avato, Raffo, et al., 2004
Avato, P.; Raffo, F.; Aldouri, N.A.; Vartanian, S.T.,
Essential oils of varthemia iphionoides from Jordan,
Flavour Fragr. J., 2004, 19, 6, 559-561, https://doi.org/10.1002/ffj.1351
. [all data]
El-Ghorab, Mansour, et al., 2004
El-Ghorab, A.H.; Mansour, A.F.; El-massry, K.F.,
Effect of extraction methods on the chemical composition and antioxidant activity of Egyptian marjoram (Majorana hortensis Moench),
Flavour Fragr. J., 2004, 19, 1, 54-61, https://doi.org/10.1002/ffj.1276
. [all data]
Lopes, Strobl, et al., 2004
Lopes, D.; Strobl, H.; Kolodziejczyk, P.,
14-Methylpentadecano-15-lactone (Muscolide): a new macrocyclic lactone from the oil of Angelica archangelica L.,
Chemistry and Biodiversity, 2004, 1, 12, 1880-1887, https://doi.org/10.1002/cbdv.200490144
. [all data]
Bouzouita, Kachouri, et al., 2003
Bouzouita, N.; Kachouri, F.; Hamdi, M.; Chaabouni, M.M.,
Antimicrobial activity of essential oils from Tunisian aromatic plants,
Flavour Fragr. J., 2003, 18, 5, 380-383, https://doi.org/10.1002/ffj.1200
. [all data]
Gkinis, Tzakou, et al., 2003
Gkinis, G.; Tzakou, O.; Iliopoulou, D.; Roussis, V.,
Chemical Composition and Biological Activity of Nepeta parnassica Oils and Isolated Nepetalactones,
Z. Naturforsch. C:, 2003, 58, 681-686. [all data]
Özcan, Tzakou, et al., 2003
Özcan, M.; Tzakou, O.; Couladis, M.,
Essential oil composition of Turkish herbal tea (Salvia aucheri Bentham var. canescens Boiss. Heldr.),
Flavour Fragr. J., 2003, 18, 4, 325-327, https://doi.org/10.1002/ffj.1229
. [all data]
Palá-Paúl, Velasco-Negueruela, et al., 2002
Palá-Paúl, J.; Velasco-Negueruela, A.; Pérez-Alonso, M.J.; Sanz, J.,
Essential oil composition of the aerial parts of Cachrys sicula L.,
Flavour Fragr. J., 2002, 17, 1, 64-68, https://doi.org/10.1002/ffj.1042
. [all data]
Raina, Lal, et al., 2002
Raina, V.K.; Lal, R.K.; Tripathi, S.; Khan, M.; Syamasundar, K.V.; Srivastava, S.K.,
Erratum. Essential oil composition of genetically diverse stocks of Murraya koenigii from India,
Flavour Fragr. J., 2002, 17, 5, 404, https://doi.org/10.1002/ffj.1139
. [all data]
Raina, Srivastava, et al., 2002
Raina, V.K.; Srivastava, S.K.; Syamasunder, K.V.,
The essential oil of 'greater galangal' [Alpinia galanga (L.) Willd.] from the lower Himalayan region of India,
Flavour Fragr. J., 2002, 17, 5, 358-360, https://doi.org/10.1002/ffj.1105
. [all data]
Rajeswara Rao, 2002
Rajeswara Rao, B.R.,
Biomass yield, essential oil yield and essential oil composition of rose-scented geranium (Pelargonium species) as influenced by row spacings and intercropping with cornmint (Mentha arvensis L.f. piperascens Malinv. ex Holmes),
Ind. Crops Prod., 2002, 16, 2, 133-144, https://doi.org/10.1016/S0926-6690(02)00038-9
. [all data]
Rao B.R.R., 2002
Rao B.R.R.,
Biomass yield, essential oil yield and essential oil composition of rose-scented geranium (Pelargonium species) as influenced by row spacings and intercropping with cornmint (Mentha arvensis L.f. piperascens Malinv. ex Holmes),
Industrial Crops and Products, 2002, 16, 2, 133-144, https://doi.org/10.1016/S0926-6690(02)00038-9
. [all data]
Shawl, Srivastava, et al., 2002
Shawl, A.S.; Srivastava, S.K.; Syamasundar, K.V.; Tripathi, S.; Raina, V.K.,
Essential oil composition of Achillea millefolium L. growing wild in Kashmir, India,
Flavour Fragr. J., 2002, 17, 3, 165-168, https://doi.org/10.1002/ffj.1074
. [all data]
Kitic, Palic, et al., 2001
Kitic, D.; Palic, R.; Ristic, M.; Sojanovic, G.; Jovanovic, T.,
The volatile constituents of Calamintha sylvatica Bromf. subsp. sylvatica,
Flavour Fragr. J., 2001, 16, 4, 257-258, https://doi.org/10.1002/ffj.995
. [all data]
Palá-Paúl, Velasco-Negueruela, et al., 2001
Palá-Paúl, J.; Velasco-Negueruela, A.; Pérez-Alonso, M.J.; Sanz, J.,
Analysis of the volatile components of Argyranthemum adauctum (Link.) Humphries by gas chromatography-mass spectrometry,
J. Chromatogr. A, 2001, 923, 1-2, 295-298, https://doi.org/10.1016/S0021-9673(01)01003-2
. [all data]
Tzakou and Couladis, 2001
Tzakou, O.; Couladis, M.,
The essential oil of Micromeria graeca (L.) Bentham et Reichenb. growing in Greece,
Flavour Fragr. J., 2001, 16, 2, 107-109, https://doi.org/10.1002/ffj.955
. [all data]
Adams, 2000
Adams, R.P.,
Systematics of smooth leaf margin Juniperus of the western hemisphere based on leaf essential oils and RAPD DNA fingerprinting,
Biochem. Syst. Ecol., 2000, 28, 2, 149-162, https://doi.org/10.1016/S0305-1978(99)00047-2
. [all data]
Adams, 2000, 2
Adams, R.P.,
Systematics of Juniperus section Juniperus based on leaf essential oils and random amplified polymorphic DNAs (RAPDs),
Biochem. Syst. Ecol., 2000, 28, 6, 515-528, https://doi.org/10.1016/S0305-1978(99)00089-7
. [all data]
Adams, 2000, 3
Adams, R.P.,
Systematics of the one seeded Juniperus of the eastern hemisphere based on leaf essential oils and random amplified polymorphic DNAs (RAPDs),
Biochem. Syst. Ecol., 2000, 28, 6, 529-543, https://doi.org/10.1016/S0305-1978(99)00096-4
. [all data]
Adams, 2000, 4
Adams, R.P.,
The serrate leaf margined Juniperus (Section Sabina) of the western hemisphere: systematics and evolution based on leaf essential oils and Random Amplified Polymorphic DNAs (RAPDs),
Biochem. Syst. Ecol., 2000, 28, 10, 975-989, https://doi.org/10.1016/S0305-1978(00)00022-3
. [all data]
Kardali, Velasco-Negueruela, et al., 2000
Kardali, M.; Velasco-Negueruela, A.; Pérez-Alonso, M.,
Essential Oil Constituents of Sideritis ibanyezii Pau,
Botanica Complutensis, 2000, 24, 101-106. [all data]
Adams, 1999
Adams, R.P.,
Systematics of multi-seeded eastern hemisphere Juniperus based on leaf essential oils and RAPD DNA fingerprinting,
Biochem. Syst. Ecol., 1999, 27, 7, 709-725, https://doi.org/10.1016/S0305-1978(99)00016-2
. [all data]
Kaul, Gujral, et al., 1999
Kaul, V.K.; Gujral, R.K.; Singh, B.,
Volatile constituents of the essential oil of flowers of Rosa brunonii Lindl,
Flavour Fragr. J., 1999, 14, 1, 9-11, https://doi.org/10.1002/(SICI)1099-1026(199901/02)14:1<9::AID-FFJ761>3.0.CO;2-C
. [all data]
Sajjadi and Ghassemi, 1999
Sajjadi, S.E.; Ghassemi, N.,
Volatile constituents of Nepeta glomerulosa Boiss. subsp. carmanica,
Flavour Fragr. J., 1999, 14, 5, 265-267, https://doi.org/10.1002/(SICI)1099-1026(199909/10)14:5<265::AID-FFJ822>3.0.CO;2-A
. [all data]
Senatore and de Feo, 1999
Senatore, F.; de Feo, V.,
Chemical composition of the essential oil from Tagetes mandonii Sch. Bip. (Asteraceae),
Flavour Fragr. J., 1999, 14, 1, 32-34, https://doi.org/10.1002/(SICI)1099-1026(199901/02)14:1<32::AID-FFJ772>3.0.CO;2-7
. [all data]
da Silva, Andrade, et al., 1999
da Silva, M.H.L.; Andrade, E.H.A.; Zoghbi, M.G.B.; Luz, A.I.R.; da Silva, J.D.; Maia, J.G.S.,
The essential oils of Lantana camara L. occurring in North Brazil,
Flavour Fragr. J., 1999, 14, 4, 208-210, https://doi.org/10.1002/(SICI)1099-1026(199907/08)14:4<208::AID-FFJ811>3.0.CO;2-F
. [all data]
Vera and Chane-Ming, 1999
Vera, R.R.; Chane-Ming, J.,
Chemical composition of the essential oil of marjoram (Origanum majorana L.) from Reunion Island,
Food Chem., 1999, 66, 2, 143-145, https://doi.org/10.1016/S0308-8146(98)00018-1
. [all data]
Adegoke, Rao, et al., 1998
Adegoke, G.O.; Rao, L.J.M.; Shankaracharya, N.B.,
A comparison of the essential oils of Aframomum daniellii (Hook. f.) K. Schum. and Amomum subulatum Roxb,
Flavour Fragr. J., 1998, 13, 5, 349-352, https://doi.org/10.1002/(SICI)1099-1026(1998090)13:5<349::AID-FFJ758>3.0.CO;2-O
. [all data]
Breheret, Talou, et al., 1997
Breheret, S.; Talou, T.; Rapior, S.; Bessiére, J.-M.,
Monoterpenes in the aroma of fresh wild mushrooms (Basidiomycetes),
J. Agric. Food Chem., 1997, 45, 3, 831-836, https://doi.org/10.1021/jf960417h
. [all data]
Tellez, Estell, et al., 1997
Tellez, M.R.; Estell, R.E.; Fredrickson, E.L.; Havstad, K.M.,
Essential oil of Dyssodia acerosa DC.,
J. Agric. Food Chem., 1997, 45, 8, 3276-3278, https://doi.org/10.1021/jf9701502
. [all data]
Padrayuttawat, Tamura, et al., 1996
Padrayuttawat, A.; Tamura, H.; Yamao, M.,
A split injection system for the analysis of purge and trap headspace of the volatile components in Citrus sudachi,
J. Hi. Res. Chromatogr., 1996, 19, 6, 365-369, https://doi.org/10.1002/jhrc.1240190613
. [all data]
Wong and Tie, 1993
Wong, K.C.; Tie, D.Y.,
The Essential Oil of the Leaves of Murraya koenigii Spreng.,
J. Essent. Oil Res., 1993, 5, 4, 371-374, https://doi.org/10.1080/10412905.1993.9698245
. [all data]
Tuberoso, Kowalczyk, et al., 2005
Tuberoso, C.I.G.; Kowalczyk, A.; Coroneo, V.; Russo, M.T.; Dessì, S.; Cabras, P.,
Chemical Composition and Antioxidant, Antimicrobial, and Antifungal Activities of the Essential Oil of Achillea ligustica All.,
J. Agric. Food Chem., 2005, 53, 26, 10148-10153, https://doi.org/10.1021/jf0518913
. [all data]
Dwivedi, Khan, et al., 2004
Dwivedi, S.; Khan, M.; Srivastava, S.K.; Syamasunnder, K.V.; Srivastava, A.,
Essential oil composition of different accessions of Mentha × piperita L. grown on the northern plains of India,
Flavour Fragr. J., 2004, 19, 5, 437-440, https://doi.org/10.1002/ffj.1333
. [all data]
Khan, Srivastava, et al., 2003
Khan, M.; Srivastava, S.K.; Jain, N.; Syamasundar, K.V.; Yadav, A.K.,
Chemical composition of fruit and stem essential oils of Lantana camara from northern India,
Flavour Fragr. J., 2003, 18, 5, 376-379, https://doi.org/10.1002/ffj.1197
. [all data]
El-Shazly, Dorai, et al., 2002
El-Shazly, A.; Dorai, G.; Wink, M.,
Composition and antimicrobial activity of essential oil and hexane-ether extract of Tanacetum santolinoides (DC.) Feinbr. and Fertig,
Z. Naturforsch., 2002, 57c, 620-623. [all data]
Frizzo, Serafini, et al., 2001
Frizzo, C.D.; Serafini, L.A.; Dellacassa, E.; Lorenzo, D.; Moyna, P.,
Essential oil of Baccharis uncinella DC. from Southern Brazil,
Flavour Fragr. J., 2001, 16, 4, 286-288, https://doi.org/10.1002/ffj.998
. [all data]
Adams, 1998
Adams, R.P.,
The essential oils and chemotaxonomy of Juniperus sect. Juniperus,
Biochem. Syst. Ecol., 1998, 26, 6, 637-645, https://doi.org/10.1016/S0305-1978(98)00020-9
. [all data]
Santos, Andrade, et al., 1998
Santos, A.S.; Andrade, E.H.A.; Zoghbi, M.G.B.; Maia, J.G.S.,
Volatile constituents of fruits of Annona glabra L. from Brazil,
Flavour Fragr. J., 1998, 13, 3, 148-150, https://doi.org/10.1002/(SICI)1099-1026(199805/06)13:3<148::AID-FFJ711>3.0.CO;2-Y
. [all data]
Bendahou, Muselli, et al., 2008
Bendahou, M.; Muselli, A.; Grignon-Dubois, M.; Benyoucef, M.; Desjobert, J.-M.; Bernardini, A.-F.; Costa, J.,
Antimicrobial activity and chemical composition of Origanum glandulosum Desf. essential oil and extract obtained by microwave extraction: Comparison with hydrodistillation,
Food Chem., 2008, 106, 1, 132-139, https://doi.org/10.1016/j.foodchem.2007.05.050
. [all data]
Belsito E.L., Carbone C., et al., 2007
Belsito E.L.; Carbone C.; Di Gioia M.L.; Leggio A.; Liguoiri A.; Perri F.; Siciliano C.; Viscomi M.C.,
Comparison of the volatile constituents in cold-pressed bergamot oil and a volatile oil isolated by vacuum distillation,
J. Agric. Food Chem., 2007, 55, 19, 7847-7851, https://doi.org/10.1021/jf070997q
. [all data]
Benkaci-Ali, Baaliouamer, et al., 2007
Benkaci-Ali, F.; Baaliouamer, A.; Meklati, B.Y.; Chemat, F.,
Chemical composition of seed essential oils from Algerian Nigella sativa extracted by microwave and hydrodistillation,
Flavour Fragr. J., 2007, 22, 2, 148-153, https://doi.org/10.1002/ffj.1773
. [all data]
Dehghan, Solaimanian, et al., 2007
Dehghan, G.; Solaimanian, R.; Shahverdi, A.R.; Amin, G.; Abdollahi, M.; Shafiee, A.,
Chemical composition and antimicrobial activity of essential oil of Ferula szovitsiana D.C.,
Flavour Fragr. J., 2007, 22, 3, 224-227, https://doi.org/10.1002/ffj.1789
. [all data]
Flamini, Cioni, et al., 2007
Flamini, G.; Cioni, P.L.; Morelli, I.; Bader, A.,
Essential oils of the aerial parts of three Salvia species from Jordan: Salvia lanigera, S. spinosa and S. syriaca,
Food Chem., 2007, 100, 2, 732-735, https://doi.org/10.1016/j.foodchem.2005.10.032
. [all data]
Flamini, Tebano, et al., 2007
Flamini, G.; Tebano, M.; Cioni, P.L.,
Volatiles emission patterns of different plant organs and pollen of Citrus limon,
Anal. Chim. Acta., 2007, 589, 1, 120-124, https://doi.org/10.1016/j.aca.2007.02.053
. [all data]
Flamini, Tebano, et al., 2007, 2
Flamini, G.; Tebano, M.; Cioni, P.L.; Ceccarini, L.; Ricci, A.S.; Longo, I.,
Comparison between the conventional method of extraction of essential oil of Laurus nobilis L. and a novel method which uses microwaves applied in situ, without resorting to an oven,
J. Chromatogr. A, 2007, 1143, 1-2, 36-40, https://doi.org/10.1016/j.chroma.2007.01.031
. [all data]
Lesueur, de Rocca Serra, et al., 2007
Lesueur, D.; de Rocca Serra, D.; Bighelli, A.; Hoi, T.M.; Ban, N.K.; Thai, T.H.; Casanova, J.,
Chemical composition and antibacterial activity of the essential oil of Michelia foveolata Merryll ex Dandy from Vietnam,
Flavour Fragr. J., 2007, 22, 4, 317-321, https://doi.org/10.1002/ffj.1799
. [all data]
Maccioni, Baldini, et al., 2007
Maccioni, S.; Baldini, R.; Luigi Cioni, P.; Tebano, M.; Flamini, G.,
In vivo volatiles emission and essential oils from different organs and pollen of Cistus albidus from Caprione (Eastern Liguria, Italy),
Flavour Fragr. J., 2007, 22, 1, 61-65, https://doi.org/10.1002/ffj.1759
. [all data]
Sabulal, Dan, et al., 2007
Sabulal, B.; Dan, M.; John, A.; Kurup, R.; Chandrika, S.P.; George, V.,
Phenylbutanoid-rich rhizome oil of Zingiber neesanum from Western Ghats, southern India,
Flavour Fragr. J., 2007, 22, 6, 521-524, https://doi.org/10.1002/ffj.1834
. [all data]
Saroglou, Marin, et al., 2007
Saroglou, V.; Marin, P.D.; Rancic, A.; Veljic, M.; Skaltsa, H.,
Composition and antimicrobial activity of the essential oil of six Hypericum species from Serbia,
Biochem. Syst. Ecol., 2007, 35, 3, 146-152, https://doi.org/10.1016/j.bse.2006.09.009
. [all data]
Blagojevic, Radulovic, et al., 2006
Blagojevic, P.; Radulovic, N.; Palic, R.; Stojanovic, G.,
Chemical composition of the essential oils of Serbian wild-growing Srtemisia absinthium and Artemisia vulgaris,
J. Agric. Food Chem., 2006, 54, 13, 4780-4789, https://doi.org/10.1021/jf060123o
. [all data]
Block, Flamini, et al., 2006
Block, S.; Flamini, G.; Brkic, D.; Morelli, I.; Quetin-Leclercq, J.,
Analysis of the essential oil from leaves of Croton zambesicus Muell. Arg. growing in Benin,
Flavour Fragr. J., 2006, 21, 2, 222-224, https://doi.org/10.1002/ffj.1558
. [all data]
Chorianopoulos N., Evergets E., et al., 2006
Chorianopoulos N.; Evergets E.; Mallouchos A.; Kalpoutzakis E.; Nychas G.J.; Haroutounian S.A.,
Characterization of the essential oil volatiles of Satureja thymbra and Satureja parnassica: Influence of harvesting time and antimicrobial activity,
J. Agric. Food Chem., 2006, 54, 8, 3139-3145, https://doi.org/10.1021/jf053183n
. [all data]
Esmaeili, Nematollahi, et al., 2006
Esmaeili, A.; Nematollahi, F.; Rustaiyan, A.; Moazami, N.; Masoudi, S.; Bamasian, S.,
Volatile constituents of Achillea pachycephala, A. oxyodonta and A. biebersteinii from Iran,
Flavour Fragr. J., 2006, 21, 2, 253-256, https://doi.org/10.1002/ffj.1571
. [all data]
Pavlovic, Kovacevic, et al., 2006
Pavlovic, M.; Kovacevic, N.; Tzakou, O.; Couladis, M.,
Essential oil composition of Anthemis triumfetti (L.) DC.,
Flavour Fragr. J., 2006, 21, 2, 297-299, https://doi.org/10.1002/ffj.1592
. [all data]
Pinto, Pina-Vaz, et al., 2006
Pinto, E.; Pina-Vaz, C.; Salgueiro, L.; Goncalves, M.J.; Costa-de-Oliveira, S.; Cavaleiro, C.; Palmeira, A.; Rodrigues, A.; Martinez-de-Oliveira, J.,
Antifuncal activity of the essential oil Thymus pulegioides on Candida, Aspergillus and dermatophyte species,
Journal of Medical Microbiology, 2006, 55, 10, 1367-1373, https://doi.org/10.1099/jmm.0.46443-0
. [all data]
Salgueiro L.R., Pinto E., et al., 2006
Salgueiro L.R.; Pinto E.; Goncalves M.J.; Costa I.; Palmeira A.; Cavaleiro C.; Pina-Vaz C.; Rodrigues A.G.; Martinez-De-Oliveira J.,
Antifungal activity of the essential oil of Thymus capitellatus against Candida, Aspergillus and dermatophyte strains,
Flavour Fragr. J., 2006, 21, 5, 749-753, https://doi.org/10.1002/ffj.1610
. [all data]
Saroglou, Dorizas, et al., 2006
Saroglou, V.; Dorizas, N.; Kypriotakis, Z.; Skaltsa, H.D.,
Analysis of the essential oil composition of eight Anthemis species from Greece,
J. Chromatogr. A, 2006, 1104, 1-2, 313-322, https://doi.org/10.1016/j.chroma.2005.11.087
. [all data]
Cioni, Flamini, et al., 2005
Cioni, P.L.; Flamini, G.; Caponi, C.; Ceccarini, L.; Morelli, I.,
Analysis of volatile fraction, fixed oil and tegumental waxes of the seeds of two different cultivars of Helianthus annuus,
Food Chem., 2005, 90, 4, 713-717, https://doi.org/10.1016/j.foodchem.2004.04.031
. [all data]
Cozzani, Muselli, et al., 2005
Cozzani, S.; Muselli, A.; Desjobert, J.-M.; Bernardini, A.-F.; Tomi, F.; Casanova, J.,
Chemical composition of essential oil of Teucrium polium subsp. capitatum (L.) from Corsica,
Flavour Fragr. J., 2005, 20, 4, 436-441, https://doi.org/10.1002/ffj.1463
. [all data]
Dugo, Mondello, et al., 2005
Dugo, P.; Mondello, L.; Favoino, O.; Cicero, L.; Rodriguez Zenteno, N.A.; Dugo, G.,
Characterization of cold-pressed Mexican dancy tangerine oils,
Flavour Fragr. J., 2005, 20, 1, 60-66, https://doi.org/10.1002/ffj.1367
. [all data]
Fanciullino, Gancel, et al., 2005
Fanciullino, A.-L.; Gancel, A.-L.; Froelicher, Y.; Luro, F.; Ollitrault, P.; Brillouet, J.-M.,
Effects of Nucleo-cytoplasmic Interactions on Leaf Volatile Compounds from Citrus Somatic Diploid Hybrids,
J. Agric. Food Chem., 2005, 53, 11, 4517-4523, https://doi.org/10.1021/jf0502855
. [all data]
de Feo, Urrunaga Soria, et al., 2005
de Feo, V.; Urrunaga Soria, E.; Urrunaga Soria, R.; Pizza, C.,
Composition and in vitro toxicity of the essential oil of Tagetes terniflora HBK. (Asteraceae),
Flavour Fragr. J., 2005, 20, 1, 89-92, https://doi.org/10.1002/ffj.1379
. [all data]
Flamini, Luigi Cioni, et al., 2005
Flamini, G.; Luigi Cioni, P.; Morelli, I.,
Composition of the essential oils and in vivo emission of volatiles of four Lamium species from Italy: L. purpureum, L. hybridum, L. bifidum and L. amplexicaule,
Food Chem., 2005, 91, 1, 63-68, https://doi.org/10.1016/j.foodchem.2004.05.047
. [all data]
Gancel, Ollitrault, et al., 2005
Gancel, A.-L.; Ollitrault, P.; Froelicher, Y.; Tomi, F.; Jacquemond, C.; Luro, F.; Brillouet, J.-M.,
Leaf volatile compounds of six citrus somatic allotetraploid hybrids originating from various combinations of lime, lemon, citron, sweet orange, and grapefruit,
J. Agric. Food Chem., 2005, 53, 6, 2224-2230, https://doi.org/10.1021/jf048315b
. [all data]
Senatore, Napolitano, et al., 2005
Senatore, F.; Napolitano, F.; Arnold, N.A.; Bruno, M.; Herz, W.,
Composition and antimicrobial activity of the essential oil of Achillea falcata L. (Asteraceae),
Flavour Fragr. J., 2005, 20, 3, 291-294, https://doi.org/10.1002/ffj.1411
. [all data]
Verzera, Trozzi, et al., 2005
Verzera, A.; Trozzi, A.; Zappala, M.; Condurso, C.; Cotroneo, A.,
Essential Oil Composition of Citrus meyerii Y. Tan. and Citrus medica L. cv. Diamante and Their Lemon Hybrids,
J. Agric. Food Chem., 2005, 53, 12, 4890-4894, https://doi.org/10.1021/jf047879c
. [all data]
Alma, Nitz, et al., 2004
Alma, M.H.; Nitz, S.; Kollmannsberger, H.; Digrak, M.; Efe, F.T.; Yilmaz, N.,
Chemical composition and antimicrobial activity of the essential oils from the gum of Turkish Pistachio (Pistacia vera L.),
J. Agric. Food Chem., 2004, 52, 12, 3911-3914, https://doi.org/10.1021/jf040014e
. [all data]
Ceccarini, Macchia, et al., 2004
Ceccarini, L.; Macchia, M.; Flamini, G.; Cioni, P.L.; Caponi, C.; Morelli, I.,
Essential oil composition of Helianthus annuus L. leaves and heads of two cultivated hybride Carlos and Florom 350,
Ind. Crops Prod., 2004, 19, 1, 13-17, https://doi.org/10.1016/S0926-6690(03)00076-1
. [all data]
Chorianopoulos, Kalpoutzakis, et al., 2004
Chorianopoulos, N.; Kalpoutzakis, E.; Aligiannis, N.; Mitaku, S.; Nychas, G.-J.; Haroutounian, S.A.,
Essential oils of Satureja, Origanum, and Thymus species: chemical composition and antibacterial activities against foodborne pathogens,
J. Agric. Food Chem., 2004, 52, 26, 8261-8267, https://doi.org/10.1021/jf049113i
. [all data]
Dugo, Mondello, et al., 2004
Dugo, P.; Mondello, L.; Zappia, G.; Bonaccorsi, I.; Cotroneo, A.; Russo, M.T.,
The composition of the volatile fraction and the enantiomeric distribution of five volatile components of faustrime oil (Monocitrus australatica x Fortunella sp. x Citrus aurantifolia),
J. Essent. Oil Res., 2004, 16, 4, 328-333, https://doi.org/10.1080/10412905.2004.9698734
. [all data]
Flamini, Bader, et al., 2004
Flamini, G.; Bader, A.; Cioni, P.L.; Katbeh-Bader, A.; Morelli, I.,
Composition of the essential oil of leaves, galls, and ripe and unripe fruits of Jordian Pistacia palaestina Boiss.,
J. Agric. Food Chem., 2004, 52, 3, 572-576, https://doi.org/10.1021/jf034773t
. [all data]
Gonny, Bradesi, et al., 2004
Gonny, M.; Bradesi, P.; Casanova, J.,
Identification of the components of the essential oil from wild Corsican Daucus carota L. using 13C-NMR spectroscopy,
Flavour Fragr. J., 2004, 19, 5, 424-433, https://doi.org/10.1002/ffj.1330
. [all data]
Javidnia, Miri, et al., 2004
Javidnia, K.; Miri, R.; Jafari, A.; Rezai, H.,
Analysis of the volatile constituents of Nepeta macrosiphon Boiss. grown in Iran,
Flavour Fragr. J., 2004, 19, 2, 156-158, https://doi.org/10.1002/ffj.1287
. [all data]
Javidnia, Miri, et al., 2004, 2
Javidnia, K.; Miri, R.; Sadeghpour, H.,
Composition of the volatile oil of Achillea wilhelmsii C. Koch from Iran,
DARU, 2004, 12, 2, 63-66, retrieved from http://www1.tums.ac.ir/daru/. [all data]
Karioti, Hadjipavlou-Litina, et al., 2004
Karioti, A.; Hadjipavlou-Litina, D.; Mensah, M.L.K.; Fleischer, T.C.; Skaltsa, H.,
Composition and antioxidant activity of the essential oils of Xylopia aethiopica (Dun) A. Rich. (Annonaceae) leaves, stem bark, root bark, and fresh and dried fruits, growing in Ghana,
J. Agric. Food Chem., 2004, 52, 26, 8094-8098, https://doi.org/10.1021/jf040150j
. [all data]
Moldão-Martins, Beirão-da-Costa, et al., 2004
Moldão-Martins, M.; Beirão-da-Costa, S.; Neves, C.; Cavaleiro, C.; Salgueiro, L.; Beirão-da-Costa, M.L.,
Olive oil flavoured by the essential oils of Mentha × piperita and Thymus mastichina L.,
Food Qual. Pref., 2004, 15, 5, 447-452, https://doi.org/10.1016/j.foodqual.2003.08.001
. [all data]
Raina, Kumar, et al., 2004
Raina, V.K.; Kumar, A.; Srivastava, S.K.; Syamsundar, K.V.; Kahol, A.P.,
Essential oil composition of 'kewda' (Pandanus odoratissimus) from India,
Flavour Fragr. J., 2004, 19, 5, 434-436, https://doi.org/10.1002/ffj.1331
. [all data]
Stashenko, Jaramillo, et al., 2004
Stashenko, E.E.; Jaramillo, B.E.; Martínez, J.R.,
Analysis of volatile secondary metabolites from Colombian Xylopia aromatica (Lamarck) by different extraction and headspace methods and gas chromatography,
J. Chromatogr. A, 2004, 1025, 1, 105-113, https://doi.org/10.1016/j.chroma.2003.10.059
. [all data]
Bader, Caponi, et al., 2003
Bader, A.; Caponi, C.; Cioni, P.L.; Flamini, G.; Morelli, I.,
Acorenone in the essential oil of flowering aerial parts of Seseli tortuosum L.,
Flavour Fragr. J., 2003, 18, 1, 57-58, https://doi.org/10.1002/ffj.1154
. [all data]
Bader, Flamini, et al., 2003
Bader, A.; Flamini, G.; Cioni, P.L.; Morelli, I.,
Essential oil composition of Achillea santolina L. and Achillea biebersteinii Afan. collected in Jordan,
Flavour Fragr. J., 2003, 18, 1, 36-38, https://doi.org/10.1002/ffj.1147
. [all data]
Cavaleiro, Salgueiro, et al., 2003
Cavaleiro, C.; Salgueiro, L.R.; da Cunha, A.P.; Figueiredo, A.C.; Barroso, J.G.; Bighelli, A.; Casanova, J.,
Composition and variability of the essential oils of the leaves and berries from Juniperus navicularis,
Biochem. Syst. Ecol., 2003, 31, 2, 193-201, https://doi.org/10.1016/S0305-1978(02)00080-7
. [all data]
de Feo, Bruno, et al., 2003
de Feo, V.; Bruno, M.; Tahiri, B.; Napolitano, F.; Senatore, F.,
Chemical composition and antibacterial activity of essential oils from Thymus spinulosus Ten. (Lamiaceae),
J. Agric. Food Chem., 2003, 51, 13, 3849-3853, https://doi.org/10.1021/jf021232f
. [all data]
de Feo, Urrunaga Soria, et al., 2003
de Feo, V.; Urrunaga Soria, E.; Urrunaga Soria, R.; Senatore, F.,
Chemical composition of essential oils of senecio nutans Sch.-Bip. (Asteraceae),
Flavour Fragr. J., 2003, 18, 3, 234-236, https://doi.org/10.1002/ffj.1204
. [all data]
Flamini, Luigi Cioni, et al., 2003
Flamini, G.; Luigi Cioni, P.; Morelli, I.,
Volatiles from leaves, fruits, and virgin oil from Olea europaea Cv. Olivastra Seggianese from Italy,
J. Agric. Food Chem., 2003, 51, 5, 1382-1386, https://doi.org/10.1021/jf020854y
. [all data]
Flamini, Luigi Cioni, et al., 2003, 2
Flamini, G.; Luigi Cioni, P.; Morelli, I.,
Differences in the fragrances of pollen, leaves, and floral parts of garland (Chrysanthemum coronarium) and composition of the essential oils from flowerheads and leaves,
J. Agric. Food Chem., 2003, 51, 8, 2267-2271, https://doi.org/10.1021/jf021050l
. [all data]
Flamini, Luigi Cioni, et al., 2003, 3
Flamini, G.; Luigi Cioni, P.; Morelli, I.,
Short communication. Use of solid-phase micro-extraction as a sampling technique in the determination of volatiles emitted by flowers, isolated flower parts and pollen,
J. Chromatogr. A, 2003, 998, 1-2, 229-233, https://doi.org/10.1016/S0021-9673(03)00641-1
. [all data]
Gancel, Ollitrault, et al., 2003
Gancel, A.-L.; Ollitrault, P.; Froelicher, Y.; Tomi, F.; Jacquemond, C.; Luro, F.; Brillouet, J.-M.,
Leaf volatile compounds of seven citrus somatic tetraploid hybrids sharing willow leaf mandarin (Citrus deliciosa Ten.) as their common parent,
J. Agric. Food Chem., 2003, 51, 20, 6006-6013, https://doi.org/10.1021/jf0345090
. [all data]
Jantan, Ling, et al., 2003
Jantan, I.; Ling, Y.E.; Romli, S.; Ayop, N.; Ahmad, A.S.,
A comparative study of the constituents of the essential oils of three Cinnamomum species from Malaysia,
J. Essent. Oil Res., 2003, 15, 6, 387-391, https://doi.org/10.1080/10412905.2003.9698618
. [all data]
Karioti, Skaltsa, et al., 2003
Karioti, A.; Skaltsa, H.; Demetzos, C.; Perdetzoglou, D.; Economakis, C.D.; Salem, A.B.,
Effect of nitrogen concentration of the nutrient solution on the volatile constituents of leaves of Salvia fruticosa Mill. in solution culture,
J. Agric. Food Chem., 2003, 51, 22, 6505-6508, https://doi.org/10.1021/jf030308k
. [all data]
Macchioni, Cioni, et al., 2003
Macchioni, F.; Cioni, P.L.; Flamini, G.; Morelli, I.; Maccioni, S.; Ansaldi, M.,
Chemical composition of essential oils from needles, branches and cones of Pinus pinea, P. halepensis, P. pinaster and P. nigra from central Italy,
Flavour Fragr. J., 2003, 18, 2, 139-143, https://doi.org/10.1002/ffj.1178
. [all data]
Mimica-Dukic, Kujundzic, et al., 2003
Mimica-Dukic, N.; Kujundzic, S.; Sokovic, M.; Couladis, M.,
Essential oil composition and antifungal activity of Foeniculum vulgare Mill. obtained by different distillation conditions,
Phytother. Res., 2003, 17, 4, 368-371, https://doi.org/10.1002/ptr.1159
. [all data]
Salido, Altarejos, et al., 2003
Salido, S.; Altarejos, J.; Nogueras, M.; Sánchez, A.; Luque, P.,
Chemical composition and seasonal variations of rosemary oil from Southern Spain,
J. Essent. Oil Res., 2003, 15, 1, 10-14, https://doi.org/10.1080/10412905.2003.9712248
. [all data]
Shellie, Marriott, et al., 2003
Shellie, R.; Marriott, P.; Zappia, G.; Mondello, L.; Dugo, G.,
Interactive use of linear retention indices on polar and apolar columns with an MS-Library for reliable characterization of Australian tea tree and other Melaleuca sp. oils,
J. Essent. Oil Res., 2003, 15, 5, 305-312, https://doi.org/10.1080/10412905.2003.9698597
. [all data]
Skaltsa, Demetzos, et al., 2003
Skaltsa, H.D.; Demetzos, C.; Lazari, D.; Sokovic, M.,
Essential oil analysis and antimicrobial activity of eight Stachys species from Greece,
Phytochemistry, 2003, 64, 3, 743-752, https://doi.org/10.1016/S0031-9422(03)00386-8
. [all data]
Verzera, Trozzi, et al., 2003
Verzera, A.; Trozzi, A.; Gazea, F.; Cicciarelloi, G.; Cotroneo, A.,
Effects of rootstock on the composition of bergamot (Citrus bergamia Risso et Poiteau) essential oil,
J. Agric. Food Chem., 2003, 51, 1, 206-210, https://doi.org/10.1021/jf0206872
. [all data]
Economakis, Skaltsa, et al., 2002
Economakis, C.; Skaltsa, H.; Demetzos, C.; Sokovic, M.; Thanos, C.A.,
Effect of phosphorus concentration of the nutrient solution on the volatile constituents of leaves and bracts of Origanum dictamnus,
J. Agric. Food Chem., 2002, 50, 22, 6276-6280, https://doi.org/10.1021/jf0203444
. [all data]
Flamini, Cioni, et al., 2002
Flamini, G.; Cioni, P.L.; Morelli, I.,
Analysis of the essential oil of the aerial parts of Viola etrusca from Monte Labbro (South Tuscany, Italy) and in vivo analysis of flower volatiles using SPME,
Flavour Fragr. J., 2002, 17, 2, 147-149, https://doi.org/10.1002/ffj.1060
. [all data]
Flamini, Cioni, et al., 2002, 2
Flamini, G.; Cioni, P.L.; Morelli, I.,
Differences in the fragrances of pollen and different floral parts of male and female flowers of Laurus nobilis,
J. Agric. Food Chem., 2002, 50, 16, 4647-4652, https://doi.org/10.1021/jf020269x
. [all data]
Lota, de Rocca Serra, et al., 2002
Lota, M.-L.; de Rocca Serra, D.; Tomi, F.; Jacquemond, C.; Casanova, J.,
Volatile components of peel and leaf oils of lemon and lime species,
J. Agric. Food Chem., 2002, 50, 4, 796-805, https://doi.org/10.1021/jf010924l
. [all data]
Miri, Ramezani, et al., 2002
Miri, R.; Ramezani, M.; Javidnia, K.; Ahmadi, L.,
Composition of the volatile oil of Thymus transcaspicus Klokov from Iran,
Flavour Fragr. J., 2002, 17, 4, 245-246, https://doi.org/10.1002/ffj.1104
. [all data]
Mondello, Zappia, et al., 2002
Mondello, L.; Zappia, G.; Cotroneo, A.; Bonaccorsi, I.; Chowdhury, J.U.; Yusuf, M.; Dugo, G.,
Studies on the essential oil-bearing plants of Bangladesh. Part VIII. Composition of some Ocimum oils O. basilicum L. var. purpurascens; O. sanctum L. green; O. sanctum L. purple; O. americanum L., citral type; O. americanum L., camphor type,
Flavour Fragr. J., 2002, 17, 5, 335-340, https://doi.org/10.1002/ffj.1108
. [all data]
Pino, Marbot, et al., 2002
Pino, J.A.; Marbot, R.; Quert, R.; García, H.,
Study of essential oils of Eucalyptus resinifera Smith, E. tereticornis Smith and Corymbia maculata (Hook.) K.D. Hill L.A.S. Johnson, grown in Cuba,
Flavour Fragr. J., 2002, 17, 1, 1-4, https://doi.org/10.1002/ffj.1026
. [all data]
Shellie, Mondello, et al., 2002
Shellie, R.; Mondello, L.; Marriott, P.; Dugo, G.,
Characterisation of lavender essential oils by using gas chromatography-mass spectrometry with correlation of linear retention indices and comparison with comprehensive two-dimensional gas chromatography,
J. Chromatogr. A, 2002, 970, 1-2, 225-234, https://doi.org/10.1016/S0021-9673(02)00653-2
. [all data]
Aligiannis, Kalpoutzakis, et al., 2001
Aligiannis, N.; Kalpoutzakis, E.; Mitaku, S.; Chinou, I.B.,
Composition and antimicrobial activity of the essential oils of two Origanum species,
J. Agric. Food Chem., 2001, 49, 9, 4168-4170, https://doi.org/10.1021/jf001494m
. [all data]
Giamakis, Kretsi, et al., 2001
Giamakis, A.; Kretsi, O.; Chinou, I.; Spyropoulos, C.G.,
Eucalyptus camaldulensis: volatiles from immature flowers and high production of 1,8-cineole and β-pinene by in vitro cultures,
Phytochemistry, 2001, 58, 2, 351-355, https://doi.org/10.1016/S0031-9422(01)00193-5
. [all data]
Lota, Serra, et al., 2001
Lota, M.-L.; Serra, D.R.; Jacquemond, C.; Tomi, F.; Casanova, J.,
Chemical variability of peel and leaf essential oils of sour orange,
Flavour Fragr. J., 2001, 16, 2, 89-96, https://doi.org/10.1002/1099-1026(200103/04)16:2<89::AID-FFJ950>3.0.CO;2-D
. [all data]
Skaltsa, Mavrommati, et al., 2001
Skaltsa, H.D.; Mavrommati, A.; Constantinidis, T.,
A chemotaxonomic investigation of volatile constituents in Stachys subsect. Swainsonianeae (Labiatae),
Phytochemistry, 2001, 57, 2, 235-244, https://doi.org/10.1016/S0031-9422(01)00003-6
. [all data]
Zabaras and Wyllie, 2001
Zabaras, D.; Wyllie, S.G.,
Quantitative analysis of terpenoids in the gas phase using headspace solid-phase microextraction (HS-SPME),
Flavour Fragr. J., 2001, 16, 6, 411-416, https://doi.org/10.1002/ffj.1025
. [all data]
Baldovini, Ristorcelli, et al., 2000
Baldovini, N.; Ristorcelli, D.; Tomi, F.; Casanova, J.,
Infraspecific variability of the essential oil of Calamintha nepeta from Corsica (France),
Flavour Fragr. J., 2000, 15, 1, 50-54, https://doi.org/10.1002/(SICI)1099-1026(200001/02)15:1<50::AID-FFJ871>3.0.CO;2-F
. [all data]
Lota, de Rocca Serra, et al., 2000
Lota, M.-L.; de Rocca Serra, D.; Tomi, F.; Casanova, J.,
Chemical variability of peel and leaf essential oils of mandarins from Citrus reticulata Blanco,
Biochem. Syst. Ecol., 2000, 28, 1, 61-78, https://doi.org/10.1016/S0305-1978(99)00036-8
. [all data]
Verzera, la Rosa, et al., 2000
Verzera, A.; la Rosa, G.; Zappalà, M.; Cotroneo, A.,
Essential oil composition of different cultivars of bergamot grown in Sicily,
Ital. J. Food Sci., 2000, 12, 4, 493-501. [all data]
Verzera, Trozzi, et al., 2000
Verzera, A.; Trozzi, A.; Cotroneo, A.; Lorenzo, D.; Dellacassa, E.,
Uruguayan essential oil. 12. Composition of Nova and Satsuma mandarin oils,
J. Agric. Food Chem., 2000, 48, 7, 2903-2909, https://doi.org/10.1021/jf990734z
. [all data]
Lota, Serra, et al., 1999
Lota, M.-L.; Serra, D.R.; Tomi, F.; Bessiere, J.-M.; Casanova, J.,
Chemical composition of peel and leaf essential oils of Citrus medica L. and C. limonimedica Lush.,
Flavour Fragr. J., 1999, 14, 3, 161-166, https://doi.org/10.1002/(SICI)1099-1026(199905/06)14:3<161::AID-FFJ801>3.0.CO;2-8
. [all data]
Mirza and Sefidkon, 1999
Mirza, M.; Sefidkon, F.,
Essential oil composition of two Salvia species from Iran, Salvia nemorosa L. and Salvia reuterana Boiss.,
Flavour Fragr. J., 1999, 14, 4, 230-232, https://doi.org/10.1002/(SICI)1099-1026(199907/08)14:4<230::AID-FFJ816>3.0.CO;2-L
. [all data]
Muselli, Hoi, et al., 1999
Muselli, A.; Hoi, T.M.; Cu, L.D.; Moi, L.D.; Bessière, J.-M.; Bighelli, A.; Casanova, J.,
Composition of the essential oil of Acanthopanax trifoliatus (L.) Merr. (Araliacaea) from Vietnam,
Flavour Fragr. J., 1999, 14, 1, 41-44, https://doi.org/10.1002/(SICI)1099-1026(199901/02)14:1<41::AID-FFJ781>3.0.CO;2-B
. [all data]
Stashenko, Cervantes, et al., 1999
Stashenko, E.E.; Cervantes, M.; Combariza, Y.; Fuentes, H.; Martínez, J.R.,
HRGC/FID and HRGC/MSD analysis of the secondary metabolites obtained by different extraction methods from Lepechinia schiedeana, an in vitro evaluation of its antioxidant activity,
J. Hi. Res. Chromatogr., 1999, 22, 6, 343-349, https://doi.org/10.1002/(SICI)1521-4168(19990601)22:6<343::AID-JHRC343>3.0.CO;2-J
. [all data]
Weyerstahl, Marschall, et al., 1999
Weyerstahl, P.; Marschall, H.; Wahlburg, H.-C.; Christiansen, C.; Rustaiyan, A.; Mirdjalili, F.,
Constituents of the essential oil of Pulicaria gnaphalodes (Vent.) Boiss. from Iran,
Flavour Fragr. J., 1999, 14, 2, 121-130, https://doi.org/10.1002/(SICI)1099-1026(199903/04)14:2<121::AID-FFJ790>3.0.CO;2-K
. [all data]
Bicchi, Rubiolo, et al., 1998
Bicchi, C.; Rubiolo, P.; Marschall, H.; Weyerstahl, P.; Laurent, R.,
Constituents of Artemisia roxburghiana Besser essential oil,
Flavour Fragr. J., 1998, 13, 1, 40-46, https://doi.org/10.1002/(SICI)1099-1026(199801/02)13:1<40::AID-FFJ688>3.0.CO;2-Z
. [all data]
Mariotti, Costa, et al., 1997
Mariotti, J.P.; Costa, J.; Bianchini, A.; Bernardini, A.F.; Casanova, J.,
Composition and variability of the essential oil of Stachys glutinosa L. from Corsica (France),
Flavour Fragr. J., 1997, 12, 3, 205-209, https://doi.org/10.1002/(SICI)1099-1026(199705)12:3<205::AID-FFJ636>3.0.CO;2-I
. [all data]
Píry, Príbela, et al., 1995
Píry, J.; Príbela, A.; Durcanská, J.; Farkas, P.,
Fractionation of volatiles from blackcurrant (Ribes nigrum L.) by different extractive methods,
Food Chem., 1995, 54, 1, 73-77, https://doi.org/10.1016/0308-8146(95)92665-7
. [all data]
Combariza, Tirado, et al., 1994
Combariza, M.Y.; Tirado, C.B.; Stashenko, E.; Shibamoto, T.,
Limonene concentration in lemon (Citrus volkameriana) peel oil as a function of ripeness,
J. Hi. Res. Chromatogr., 1994, 17, 9, 643-646, https://doi.org/10.1002/jhrc.1240170905
. [all data]
Yang, Sugisawa, et al., 1992
Yang, R.; Sugisawa, H.; Nakatani, H.; Tamura, H.; Takagi, N.,
Comparison of odor quality in peel oils of acid citrus,
Nippon Shokuhin Kogyo Gakkaishi, 1992, 39, 1, 16-24, https://doi.org/10.3136/nskkk1962.39.16
. [all data]
Le Quere and Latrasse, 1990
Le Quere, J.-L.; Latrasse, A.,
Composition of the Essential Oils of Blackcurrant Buds (Ribes nigrum L.),
J. Agric. Food Chem., 1990, 38, 1, 3-10, https://doi.org/10.1021/jf00091a001
. [all data]
Andriamaharavo, 2014
Andriamaharavo, N.R.,
Retention Data. NIST Mass Spectrometry Data Center., NIST Mass Spectrometry Data Center, 2014. [all data]
Oliveira, Campos, et al., 2005
Oliveira, M.J.; Campos, I.F.P.; Oliveira, C.B.A.; Santos, M.R.; Souza, P.S.; Santos, S.C.; Seraphin, J.C.; Ferri, P.H.,
Influence of growth phase on the essential oil composition of Hyptis suaveolens,
Biochem. Syst. Ecol., 2005, 33, 3, 275-285, https://doi.org/10.1016/j.bse.2004.10.001
. [all data]
Sacchetti, Maietti, et al., 2005
Sacchetti, G.; Maietti, S.; Muzzoli, M.; Scaglianti, M.; Manfredini, S.; Radice, M.; Bruni, R.,
Comparative evaluation of 11 essential oils of different origin as functional antioxidants, antiradicals and antimicrobials in foods,
Food Chem., 2005, 91, 4, 621-632, https://doi.org/10.1016/j.foodchem.2004.06.031
. [all data]
Frizzo, Lorenzo, et al., 2004
Frizzo, C.D.; Lorenzo, D.; Dellacassa, E.,
Composition and seasonal variation of the essential oils from two mandarin cultivars of Southern Brazil,
J. Agric. Food Chem., 2004, 52, 10, 3036-3041, https://doi.org/10.1021/jf030685x
. [all data]
Azevedo, Campos, et al., 2002
Azevedo, N.R.; Campos, I.F.P.; Ferreira, H.D.; Portes, T.A.; Seraphin, J.C.; de Paula, J.R.; Santos, S.C.; Ferri, P.H.,
Essential oil chemotypes in Hyptis suaveolens from Brazilian Cerrado,
Biochem. Syst. Ecol., 2002, 30, 3, 205-216, https://doi.org/10.1016/S0305-1978(01)00075-8
. [all data]
Filippini, Tomi, et al., 2000
Filippini, M.-H.; Tomi, F.; Casanova, J.,
Composition of the leaf oil of Ferula arrigonii Bocchieri,
Flavour Fragr. J., 2000, 15, 3, 195-198, https://doi.org/10.1002/1099-1026(200005/06)15:3<195::AID-FFJ891>3.0.CO;2-6
. [all data]
Choi, Kim. M.-S.L., et al., 2002
Choi, H.-S.; Kim. M.-S.L.; Sawamura, M.,
Constituents of the essential oil of cnidium officinale Makino, a Korean medicinal plant,
Flavour Fragr. J., 2002, 17, 1, 49-53, https://doi.org/10.1002/ffj.1038
. [all data]
Brophy, Goldsack, et al., 2000
Brophy, J.J.; Goldsack, R.J.; Punruckvong, A.; Bean, A.R.; Forster, P.I.; Lepschi, B.J.; Doran, J.C.; Rozefelds, A.C.,
Leaf essential oils of the genus Leptospermum (Myrtaceae) in eastern Australia. Part 7. Leptospermum petersonii, L. liversidgei and allies,
Flavour Fragr. J., 2000, 15, 5, 342-351, https://doi.org/10.1002/1099-1026(200009/10)15:5<342::AID-FFJ924>3.0.CO;2-V
. [all data]
Bisio, Ciarallo, et al., 1998
Bisio, A.; Ciarallo, G.; Romussi, G.; Fontana, N.; Mascolo, N.; Capasso, R.; Biscardi, D.,
Chemical Composition of Essential Oils from some Salvia species,
Phytother. Res., 1998, 12, S1, s117-s120, https://doi.org/10.1002/(SICI)1099-1573(1998)12:1+3.0.CO;2-2
. [all data]
Sardashti, Valizadeh, et al., 2013
Sardashti, A.R.; Valizadeh, J.; Adhami, Y.,
Variations in the essential oil composition of Peroskia abrotonolides of different growth stage in Baluchestan,
Middle-East J. Sci. Res., 2013, 13, 6, 781-784. [all data]
Ogunwande, Flamini, et al., 2010
Ogunwande, I.A.; Flamini, G.; Cioni, P.L.; Omikorede, O.; Azeez, R.A.; Ayodele, A.A.; Kamil, Y.O.,
Aromatic plants growing in Nigeria: essential oil constituents of Cassia alata (Linn.) Roxb. and Helianthus annuus L.,
Rec. Nat. Prod., 2010, 4, 4, 211-217. [all data]
Takeoka, Hobbs, et al., 2010
Takeoka, G.R.; Hobbs, C.; Byeoung-Soo, P.,
Volatile constituents of the aerial parts of Salvia apiana Jepson,
J. Essential Oil. Res., 2010, 22, 3, 241-244, https://doi.org/10.1080/10412905.2010.9700314
. [all data]
Alim, Goze, et al., 2009
Alim, A.; Goze, I.; Cetin, A.; Atas, A.; Vural, N.; Donmez, E.,
Antimicrobial activity of the essential oil of Cyclotrichimun niveum (Boiss.) Manden. Et Scheng,
African J. Microbiol. Res., 2009, 3, 8, 422-425. [all data]
Museli, Pau, et al., 2009
Museli, A.; Pau, M.; Desjobert, J.-M.; Foddai, M.; Usai, M.; Costa, J.,
Volatile constituents of Achllea ligustica All. by HS-SPME/GC/GC-MS. Comparison with essential oils obtained by hydrodistillation from Corsica and Sardinia,
Chromatographia, 2009, 69, 5/6, 575-585, https://doi.org/10.1365/s10337-008-0939-1
. [all data]
Porto, Decorti, et al., 2009
Porto, C.Da.; Decorti, D.; Kikic, I.,
Flavour compounds of Lavandula angustifolia L. to use in food manufacturing: comparison of three different extraction methods,
Food Chem., 2009, 112, 4, 1072-1078, https://doi.org/10.1016/j.foodchem.2008.07.015
. [all data]
Flamini, Tebano, et al., 2008
Flamini, G.; Tebano, M.; Cioni, P.L.,
Composition of the essential oils from leafy parts of the shoots, flowers and fruits of Eryngium amethystinum from Amiata Mount (Tuscany, Italy),
Food Chem., 2008, 107, 2, 671-674, https://doi.org/10.1016/j.foodchem.2007.08.064
. [all data]
Lo Presti, Sciarrone, et al., 2008
Lo Presti, M.; Sciarrone, D.; Crupi, M.C.; Costa, R.; Ragusa, S.; Dugo, G.; Mondello, L.,
Evaliation of the volatile and chiral composition in Pistacia lentiscus L. essential oil,
Flavour Fragr. J., 2008, 23, 4, 249-257, https://doi.org/10.1002/ffj.1878
. [all data]
Mierendorff, Stahl-Biskup, et al., 2008
Mierendorff, H.-G.; Stahl-Biskup, E.; Posthumus, M.A.; van Beek, T.A.,
Composition of commercial Cape chamomile oil (Eriocephalus punctuatus / Eriocephalus tenuifolius), 2008, retrieved from http://www.chemische-analysen-hamburg.de/Publikationen?CapeChamomileOil/. [all data]
Sahraoui, Vian, et al., 2008
Sahraoui, N.; Vian, M.A.; Bornard, I.; Boutekedjiret, C.; Chemat, F.,
Improved microwave steam distillation apparatus for isolation of essential oils. Comparison with conventional steam distillation,
J. Chromatogr. A., 2008, 1210, 2, 229-233, https://doi.org/10.1016/j.chroma.2008.09.078
. [all data]
Sarikurkcu, Tepe, et al., 2008
Sarikurkcu, C.; Tepe, B.; Daferera, D.; Polissiou, M.; Harmandar, M.,
Studies on the anioxidant activity of the essential oil and methanol extract of Marrubium globosum subsp. globosum (lamiaceae) by three different chemical assays,
Bioresource Technol., 2008, 99, 10, 4239-4246, https://doi.org/10.1016/j.biortech.2007.08.058
. [all data]
Skalicka-Wozniak, Los, et al., 2008
Skalicka-Wozniak, K.; Los, R.; Glowniak, K.; Malm, A.,
Variation of the volatile content of the fruits of Peucedanum alsaticum L.,
Acta Chromatographica, 2008, 20, 1, 119-133, https://doi.org/10.1556/AChrom.20.2008.1.10
. [all data]
Victorio, Alviano, et al., 2008
Victorio, C.P.; Alviano, D.S.; Alviano, C.S.; Lage, C.L.S.,
Chemical composition of the fractions of leaf oil of Alpina zarumbet (Pers.) B.L. Burrt R.M. Sm. and antimicrobial activity,
Brazilian J. of Pharamacognosy, 2008, 19, 3, 697-701. [all data]
Adams, Beauchamp, et al., 2007
Adams, R.P.; Beauchamp, P.S.; Dev, V.; Dutz, S.M.,
New Natural Products Isolated from One-Seeded Juniperus of the Southwestern United States: Isolation and Occurence of 2-Ethenyl-3-methyl Phanol and Its Derivatives,
J. Essent. Oil Res., 2007, 19, 2, 146-152, https://doi.org/10.1080/10412905.2007.9699247
. [all data]
Amiri, 2007
Amiri, H.,
Quantative and qualative changes of essential oil of Salvia bracteata BAnk et Sol. in different growth stages,
DARU, 2007, 15, 2, 79-82. [all data]
Bicchi, Cordero, et al., 2007
Bicchi, C.; Cordero, C.; Liberto, E.; Rubiolo, P.; Sgorbini, B.; Sandra, P.,
Sorptive tape extraction in the analysis of the volatile fraction emitted from biological solid matrices,
J. Chromatogr. A, 2007, 1148, 2, 137-144, https://doi.org/10.1016/j.chroma.2007.03.007
. [all data]
Bos, Woerdenbag, et al., 2007
Bos, R.; Woerdenbag, H.J.; Kayser, O.; Quax, W.J.; Ruslan, K.; Elfami,
Essential oil constituents of Piper cubeba L. fils. from Indonesia,
J. Essent. Oil Res., 2007, 19, 1, 14-17, https://doi.org/10.1080/10412905.2007.9699217
. [all data]
Cheraif, Ben Jannet, et al., 2007
Cheraif, I.; Ben Jannet, H.; Hammami, M.; Khouja, M.L.; Mighri, Z.,
Chemical composition and antimicrobial activity of essential oils of Cupressus arizonica Greene,
Biochem. Syst. Ecol., 2007, 35, 12, 813-820, https://doi.org/10.1016/j.bse.2007.05.009
. [all data]
Elfami, Bos, et al., 2007
Elfami; Bos, R.; Ruslan, K.; Woerdenbag, H.J.; Kayser, P.; Quax, W.J.,
Essential Oil Constituents of Piper cubeba from Indonesia, 2007, 53-60. [all data]
El-Ghorab A., El-Massry K.F., et al., 2007
El-Ghorab A.; El-Massry K.F.; Shibamoto T.,
Chemical composition of the volatile extract and antioxidant activities of the volatile and nonvolatile extracts of Egyptian corn silk (Zea mays L.),
J. Agric. Food Chem., 2007, 55, 22, 9124-9127, https://doi.org/10.1021/jf071646e
. [all data]
Ferhat, Meklati, et al., 2007
Ferhat, M.A.; Meklati, B.Y.; Chemat, F.,
Comparison of different isolation methods of essential oil from Citrus fruits: cold pressing, hydrodistillation and microwave dry distillation,
Flavour Fragr. J., 2007, 22, 6, 494-504, https://doi.org/10.1002/ffj.1829
. [all data]
Gil A., Van Baren C.M., et al., 2007
Gil A.; Van Baren C.M.; Lira P.M.D.L.; Bandoni A.L.,
Identification of the genotype from the content and composition of the essential oil of lemon verbena (Aloysia citriodora Palau),
J. Agric. Food Chem., 2007, 55, 21, 8664-8669, https://doi.org/10.1021/jf0708387
. [all data]
Gudaityte and Venskutonis R.P., 2007
Gudaityte, O.; Venskutonis R.P.,
Chemotypes of Achillea millefolium transferred from 14 different locations in Lithuania to the controlled environment,
Biochem. Syst. Ecol., 2007, 35, 9, 582-592, https://doi.org/10.1016/j.bse.2007.03.016
. [all data]
Hachicha, Skanji, et al., 2007
Hachicha, S.F.; Skanji, T.; Barrek, S.; Ghrabi, Z.G.; Zarrouk, H.,
Composition of the essential oil of Teucrium ramosissimum Desf. (Lamiaceae) from Tunisia,
Flavour Fragr. J., 2007, 22, 2, 101-104, https://doi.org/10.1002/ffj.1764
. [all data]
Hudaib and Aburjai, 2007
Hudaib, M.; Aburjai, T.,
Volatile components of Thymus vulgaris L. from wild-growing and cultivated plants in Jordan,
Flavour Fragr. J., 2007, 22, 4, 322-327, https://doi.org/10.1002/ffj.1800
. [all data]
Mohottalage, Tabacchi, et al., 2007
Mohottalage, S.; Tabacchi, R.; Guerin, P.M.,
Components from Sri Lankan Piper betle L. leaf oil and their analogues showing toxicity against the housefly, Musca domestica,
Flavour Fragr. J., 2007, 22, 2, 130-138, https://doi.org/10.1002/ffj.1770
. [all data]
Monser-Esfahani, Karamkhani, et al., 2007
Monser-Esfahani, H.R.; Karamkhani, F.; Nickavar, B.; Abdi, K.; Faramarzi, M.A.,
The Volatile Constituents of Dracocephalum kotschyi Oils,
Chem. Nat. Comp., 2007, 43, 1, 40-43, https://doi.org/10.1007/s10600-007-0027-z
. [all data]
Pinto, Salgueiro, et al., 2007
Pinto, E.; Salgueiro, L.R.; Cavaleiro, C.; Palmeira, A.; Goncalves, M.J.,
In vitro susceptibility of some species of yeasts and filamentous fungi to essential oils of Salvia of?cinalis,
Ind. Crops Prod., 2007, 26, 2, 135-141, https://doi.org/10.1016/j.indcrop.2007.02.004
. [all data]
Salehi, Fakhari, et al., 2007
Salehi, P.; Fakhari, A.R.; Ebrahimi, S.N.; Heydari, R.,
Rapid essential oil screening of Rosmarinus officinalis L. by hydrodistillation-headspace solvent microextraction,
Flavour Fragr. J., 2007, 22, 4, 280-285, https://doi.org/10.1002/ffj.1793
. [all data]
Sefidkon, Abbasi, et al., 2007
Sefidkon, F.; Abbasi, K.; Jamzad, Z.; Ahmadi, S.,
The effect of distillation methods and stage of plant growth on the essential oil content and composition of Satureja rechingeri Jamzad,
Food Chem., 2007, 100, 3, 1054-1058, https://doi.org/10.1016/j.foodchem.2005.11.016
. [all data]
Tiwary, Nail, et al., 2007
Tiwary, M.; Nail, S.N.; Tewary, D.K.; Mittal, P.K.; Yadav, S.,
Chemical composition and larvicidal activities of the essential oil of Zanthoxylum armatum DC (Rutaceae) against three mosquito vectors,
J. Vect. Borne Dis., 2007, 44, 9, 198-204. [all data]
Tzakou, Bazos, et al., 2007
Tzakou, O.; Bazos, I.; Yannitsaros, A.,
Volatile metabolites of Pistacia atlantica Desf. from Greece,
Flavour Fragr. J., 2007, 22, 5, 358-362, https://doi.org/10.1002/ffj.1805
. [all data]
Vagionas, Graikou, et al., 2007
Vagionas, K.; Graikou, K.; Ngassapa, O.; Runyoro, D.; Chinou, I.,
Composition and antimicrobial activity of the essential oils of three Satureja species growing in Tansania,
Food Chem., 2007, 103, 2, 319-324, https://doi.org/10.1016/j.foodchem.2006.07.051
. [all data]
Vichi, Riu-Aumatell, et al., 2007
Vichi, S.; Riu-Aumatell, M.; Mora-Pons, M.; Guadayol, J.M.; Buxaderas, S.; López-Tamames, E.,
Analytical, Nutritional and Clinical Methods. HS-SPME coupled to GC/MS for quality control of Juniperus communis L. berries used for gin aromatization,
Food Chem., 2007, 105, 4, 1748-1754, https://doi.org/10.1016/j.foodchem.2007.03.026
. [all data]
Biondi, Sari, et al., 2006
Biondi, D.M.; Sari, M.i.; Ghani, Z.A.l.; Ruberto, G.,
Essential oil of Algerian Saccocalyx satureioides Coss. et Durieu,
Flavour Fragr. J., 2006, 21, 3, 546-548, https://doi.org/10.1002/ffj.1661
. [all data]
Borges, Rojas, et al., 2006
Borges, R.; Rojas, L.B.; Cegarra, J.A.; Usubillaga, A.,
Study of the essential oils from the leaves and flowers of Lepechinia conferta (Benth) Epl.,
Flavour Fragr. J., 2006, 21, 1, 155-157, https://doi.org/10.1002/ffj.1550
. [all data]
Coronel, Cerda-Garcia-Rojas, et al., 2006
Coronel, A. del.C.; Cerda-Garcia-Rojas, C.M.; Joseph-Nathan, P.; Catalán, C.A.N.,
Chemical composition, seasonal variation and a new sesquiterpene alcohol from the essential oil of Lippia integrifolia,
Flavour Fragr. J., 2006, 21, 5, 839-847, https://doi.org/10.1002/ffj.1736
. [all data]
Ebrahim Sajjadi and Mehregan, 2006
Ebrahim Sajjadi, S.; Mehregan, I.,
Volatile constituents of flowers and leaves of Anthemis hyalina,
Chem. Nat. Compd. (Engl. Transl.), 2006, 42, 5, 531-533, https://doi.org/10.1007/s10600-006-0207-2
. [all data]
Elfami, Komar, et al., 2006
Elfami, R.B.; Komar, R.; Woerdenbag, H.J.; Kayser, P.; Quax, W.J.,
Essential oil constituents of Piper cubeba from Indonesia, 2006, retrieved from http://dissertations.ub.rug.nl/FILES/facultiew/science/2006/elfahmi/05c5.pdf. [all data]
Fanciullino, Tomi, et al., 2006
Fanciullino, A.-L.; Tomi, F.; Luro, F.; Desjobert, J.M.; Casanova, J.,
Chemical variability of peel and leaf oils of mandarins,
Flavour Fragr. J., 2006, 21, 2, 359-367, https://doi.org/10.1002/ffj.1658
. [all data]
Figuérédo, Cabassu, et al., 2006
Figuérédo, G.; Cabassu, P.; Chalchat, J.-C.; Pasquier, B.,
Studies of Mediterranean oregano populations. VIII. Chemical composition of essential oils of oreganos of various origins,
Flavour Fragr. J., 2006, 21, 1, 134-139, https://doi.org/10.1002/ffj.1543
. [all data]
Filippi, Lanfranchi, et al., 2006
Filippi, J.-J.; Lanfranchi, D.-A.; Prado, S.; Baldovini, N.; Meierhenrich, U.J.,
Composition, Enantiomeric Distribution, and Antibacterial Activity of the Essential Oil of Achillea ligustica All. from Corsica,
J. Agric. Food Chem., 2006, 54, 17, 6308-6313, https://doi.org/10.1021/jf060752y
. [all data]
Havlik, Kokoska, et al., 2006
Havlik, J.; Kokoska, L.; Vasickova, S.; Valterova, I.,
Chemical composition of essential oil from the seeds of Nigella arvensis L. and assessment of its actimicrobial activity,
Flavour Fragr. J., 2006, 21, 4, 713-717, https://doi.org/10.1002/ffj.1713
. [all data]
Lan Phi N.T., Nishiyama C., et al., 2006
Lan Phi N.T.; Nishiyama C.; Choi H.-S.; Sawamura M.,
Evaluation of aroma characteristic compounds of Citrus natsudaidai Hayata (Natsudaidai) cold-pressed peel oil,
Biosci. Biotechnol. Biochem., 2006, 70, 8, 1832-1838, https://doi.org/10.1271/bbb.50705
. [all data]
Li, Lee, et al., 2006
Li, Z.-G.; Lee, M.-R.; Shen, D.-L.,
Analysis of volatile compounds emitted from fresh Syringa oblata flowers in different florescence by headspace solid-phase microextraction-gas chromatography-mass spectrometry,
Anal. Chim. Acta., 2006, 576, 1, 43-49, https://doi.org/10.1016/j.aca.2006.01.074
. [all data]
Martin, Joseph, et al., 2006
Martin, M.A.C.K.; Joseph, H.; Bercion, S.; Menut, C.,
Chemical composition of essential oils from aerial parts of Aframomum exscapum (Sims) Hepper collected in Guadeloupe, French West Indies,
Flavour Fragr. J., 2006, 21, 6, 902-905, https://doi.org/10.1002/ffj.1741
. [all data]
Marongiu, Piras, et al., 2006
Marongiu, B.; Piras, A.; Porcedda, S.; Tuveri, E.; Maxia, A.,
Isolation of Seseli bocconi Guss. volatile oil by supercritical carbon dioxide extraction,
Natural Product Research, 2006, 20, 9, 820-826, https://doi.org/10.1080/14786410500364684
. [all data]
Ouamba, Ouabonzi, et al., 2006
Ouamba, J.-M.; Ouabonzi, A.; Ekouya, A.; Bessière, J.-M.; Menut, C.; Abena, A.A.; Banzouzi, J.-T.,
Volatile constituents of the essential oil leaf of Lantana salvifolia Jacq. (Verbenaceae),
Flavour Fragr. J., 2006, 21, 1, 158-161, https://doi.org/10.1002/ffj.1553
. [all data]
Ozcan, Chalchat, et al., 2006
Ozcan, M.M.; Chalchat, J.-C.; Arslan, D.; Ates, A.; Unver, A.,
Comparative Essential Oil Composition and Antifungal Effect of Bitter Fennel (Foeniculum vulgare ssp. piperitum) Fruit Oils Obtained During Different Vegetation,
J. Medicinal Food, 2006, 9, 4, 552-561, https://doi.org/10.1089/jmf.2006.9.552
. [all data]
Pintore G., Chessa M., et al., 2006
Pintore G.; Chessa M.; Manconi P.; Zanetti S.; Deriu A.; Tirillini B.,
Chemical composition and antimicrobial activities of essential oil of stachys glutinosa L. from Sardinia,
Natural Product Communications, 2006, 1, 12, 1133-1136. [all data]
Pino, Marbot, et al., 2006
Pino, J.A.; Marbot, R.; Payo, A.; Chao, D.; Herrera, P.,
Aromatic Plants from Western Cuba VII. Composition of the Leaf Oil of Psidium wrightii KRug et Urb., Lantana involucrata L., Cinnamonum montanum (Sw.) Berchtold et J. Persl. and Caesalpinia violacea (Mill.) Standley,
J. Essent. Oil. Res., 2006, 18, 2, 170-174, https://doi.org/10.1080/10412905.2006.9699058
. [all data]
Sabulal, Dan, et al., 2006
Sabulal, B.; Dan, M.; Anil, J.J.; Kurup, R.; Pradeep, N.S.; Valsamma, R.K.; George, V.,
Caryophyllene-rich rhizome oil of Zingiber nimmonii from South India: Chemical characterization and antimicrobial activity,
Phytochemistry, 2006, 67, 22, 2469-2473, https://doi.org/10.1016/j.phytochem.2006.08.003
. [all data]
Sefidkon and Jamzad, 2006
Sefidkon, F.; Jamzad, Z.,
Chemical composition of the essential oil of Gontscharovia popovii from Iran,
Flavour Fragr. J., 2006, 21, 4, 619-621, https://doi.org/10.1002/ffj.1628
. [all data]
Sefidkon, Jamzad, et al., 2006
Sefidkon, F.; Jamzad, Z.; Mirza, M.,
Chemical composition of the essential oil of five Iranian Nepeta species (N. crispa, N. mahanensis, N. ispahanica, N. eremophila and N. rivularis),
Flavour Fragr. J., 2006, 21, 5, 764-767, https://doi.org/10.1002/ffj.1668
. [all data]
Silva, Oliveira, et al., 2006
Silva, N.A.; Oliveira, F.F.; Costa, L.C.B.; Bizzo, H.R.; Oliveira, R.A.,
Caracterização química do óleo essencial da erva cidreira (Lippia alba (Mill.) N. E. Br.) cultivada em Ilhéus na Bahia,
Rev. Bras. Pl. Med., Botucatu, 2006, 8, 3, 52-55. [all data]
Velasco-Negueruela, Pérez-Alonso, et al., 2006
Velasco-Negueruela, A.; Pérez-Alonso, M.J.; Pérez de Paz, P.L.; Palá-Paúl, J.; Sanz, J.,
Analysis by gas chromatography?mass spectrometry of the volatiles from the fruits of Ammodaucus leucotrichus subsp. leucotrichus and subsp. nanocarpus grown in North Africa and the Canary Islands, respectively,
J. Chromatogr. A, 2006, 1108, 2, 273-275, https://doi.org/10.1016/j.chroma.2006.01.031
. [all data]
Basta, Tzakou, et al., 2005
Basta, A.; Tzakou, O.; Couladis, M.,
Composition of the leaves essential oil of Melissa officinalis s. l. from Greece,
Flavour Fragr. J., 2005, 20, 6, 642-644, https://doi.org/10.1002/ffj.1518
. [all data]
Chagonda and Chalchat, 2005
Chagonda, L.S.; Chalchat, J.-C.,
The essential oil of wild and cultivated Hoslundia opposita Vahl. from Zimbabwe,
Flavour Fragr. J., 2005, 20, 2, 193-195, https://doi.org/10.1002/ffj.1402
. [all data]
Chalchat and Özcan, 2005
Chalchat, J.-C.; Özcan, M.,
Constituents of the essential oil of Sideritis erythantha Boiss. Heldr. Var. erythrantha,
Gen. Appl. Plant Physiology, 2005, 31, 1-2, 65-70. [all data]
Figuérédo, Cabassu, et al., 2005
Figuérédo, G.; Cabassu, P.; Chalchat, J.-C.; Pasquier, B.,
Studies of Mediterranean oregano populations- V. Chemical composition of essential oils of oregano: Origanum syriacum L. var. bevanii (Holmes) Ietswaart, O. syriacum L. var. sinaicum (Boiss.) Ietswaart, and O. syriacum L. var. syriacum from Lebanon and Israel,
Flavour Fragr. J., 2005, 20, 164-168. [all data]
Melkani, Dev, et al., 2005
Melkani, A.B.; Dev, V.; Beauchamp, P.S.; Negi, A.; Mehta, S.P.S.; Melkani, K.B.,
Constituents of the essential oil of a new chemotype of Elsholtzia strobilifera Benth.,
Biochem. Syst. Ecol., 2005, 33, 4, 419-425, https://doi.org/10.1016/j.bse.2004.10.009
. [all data]
Morteza-Semnani and Saeedi, 2005
Morteza-Semnani, K.; Saeedi, M.,
The essential oil composition of Phlomis bruguieri Desf. from Iran,
Flavour Fragr. J., 2005, 20, 3, 344-346, https://doi.org/10.1002/ffj.1459
. [all data]
Oyedeji, Yani, et al., 2005
Oyedeji, O.A.; Yani, V.V.; Afolayan, A.J.,
Chemical composition of the essential oil from Arctotis arctotoides (L.F.) O. Hoffm. (syn. Vendium arctotoides Less.),
Flavour Fragr. J., 2005, 20, 2, 232-234, https://doi.org/10.1002/ffj.1437
. [all data]
Özel, Gögüs, et al., 2005
Özel, M.Z.; Gögüs, F.; Hamilton, J.F.; Lewis, A.C.,
Analysis of volatile components from Ziziphora taurica subsp. taurica by steam distillation, superheated-water extraction, and direct thermal desorption with GC×GC-TOFMS,
Anal. Bioanal. Chem., 2005, 382, 1, 115-119, https://doi.org/10.1007/s00216-005-3156-x
. [all data]
Rasooli and Owlia, 2005
Rasooli, I.; Owlia, P.,
Chemoprevention by thyme oils of Aspergillus parasiticus growth and aflatoxin production,
Phytochemistry, 2005, 66, 24, 2851-2856, https://doi.org/10.1016/j.phytochem.2005.09.029
. [all data]
Rout, Misra, et al., 2005
Rout, P.K.; Misra, R.; Sahoo, S.; Sree, A.; Rao, Y.R.,
Extraction of kewda (Pandanus fascicularis Lam.) flowers with hexane: composition of concrete, absolute and wax,
Flavour Fragr. J., 2005, 20, 4, 442-444, https://doi.org/10.1002/ffj.1466
. [all data]
Saeidnia, Gohari, et al., 2005
Saeidnia, S.; Gohari, A.R.; Yassa, N.; Shafiee, A.,
Composition of the volatile oil of Achillea conferta DC. from Iran,
DARU, 2005, 13, 1, 34-36. [all data]
Sajjadi S.E. and Eskandari B., 2005
Sajjadi S.E.; Eskandari B.,
Chemical constituents of the essential oil of Nepeta oxyodonta,
Chem. Nat. Compd. (Engl. Transl.), 2005, 41, 2, 175-177, https://doi.org/10.1007/s10600-005-0106-y
. [all data]
Sajjadi and Ghannadi, 2005
Sajjadi, S.-E.; Ghannadi, A.,
Essential oil of the Persian sage, Salvia rhytidea Benth.,
Acta Pharm. Sin., 2005, 55, 321-326. [all data]
Sajjadi, 2005
Sajjadi, S.E.,
Analysis of the essential oil of Nepeta sintenisii Bornm. from Iran,
DARU, 2005, 13, 2, 61-64. [all data]
Salehi, Sonboli, et al., 2005
Salehi, P.; Sonboli, A.; Eftekhar, F.; Nejad-Ebrahimi, S.; Yousefzadi, M.,
Essential Oil Composition, Antibacterial and Antioxidant Activity of the Oil and Various Extracts of Ziziphora clinopodioides subsp. rigida (BOISS.) RECH. f. from Iran,
Biol. Pharm. Bull., 2005, 28, 10, 1892-1896, https://doi.org/10.1248/bpb.28.1892
. [all data]
Sefidkon and Jamzad, 2005
Sefidkon, F.; Jamzad, Z.,
Chemical composition of the essential oil of three Iranian Satureja species (S. mutica, S. macrantha and S. intermedia),
Food Chem., 2005, 91, 1, 1-4, https://doi.org/10.1016/j.foodchem.2004.01.027
. [all data]
Skoula and Grayer, 2005
Skoula, M.; Grayer, R.J.,
Volatile oils of Coridothymus capitatus, Satureja thymbra, Satureja spinosa and Thymbra calostachya (Lamiaceae) from Crete,
Flavour Fragr. J., 2005, 20, 6, 573-576, https://doi.org/10.1002/ffj.1489
. [all data]
Slavkovska, Couladis, et al., 2005
Slavkovska, V.; Couladis, M.; Bojovic, S.; Tzakou, O.; Pavlovic, M.; Lakusic, B.; Jancic, R.,
Essential oil and its systematic significance in species of Micromeria Bentham from Serbia Montenegro,
Plant Systematics and Evolution, 2005, 255, 1-2, 1-15, https://doi.org/10.1007/s00606-005-0303-y
. [all data]
Sonboli, Salehi, et al., 2005
Sonboli, A.; Salehi, P.; Allahyari, L.,
Essential oil composition of Nepeta involucrata from Iran,
Chem. Nat. Compd. (Engl. Transl.), 2005, 41, 6, 683-685, https://doi.org/10.1007/s10600-006-0011-z
. [all data]
Tepe B., Sokmen M., et al., 2005
Tepe B.; Sokmen M.; Akpulat H.A.; Daferera D.; Polissiou M.; Sokmen A.,
Antioxidative activity of the essential oils of Thymus sipyleus subsp sipyleus var. sipyleus and Thymus sipyleus subsp sipyleus var. rosulans,
J. Food Eng., 2005, 66, 4, 447-454, https://doi.org/10.1016/j.jfoodeng.2004.04.015
. [all data]
Tzakou, Bazos, et al., 2005
Tzakou, O.; Bazos, I.; Yannitsaros, A.,
Essential oils of leaves, inflorescences and infructescences of spontaneous Cotinus coggygria Scop. from Greece,
Flavour Fragr. J., 2005, 20, 5, 531-533, https://doi.org/10.1002/ffj.1456
. [all data]
Tzakou and Constantinidis, 2005
Tzakou, O.; Constantinidis, T.,
Chemotaxonomic significance of volatile compounds in Thymus samius and its related species Thymus atticus and Thymus parnassicus,
Biochem. Syst. Ecol., 2005, 33, 11, 1131-1140, https://doi.org/10.1016/j.bse.2005.03.008
. [all data]
Utsunomia, Kawata, et al., 2005
Utsunomia, H.; Kawata, J.; Chanoki, W.; Shirakawa, N.; Miyazawa, M.,
Components of Essential Oil from Woods of Prunus mume Sieb. at Zucc.,
J. Oleo Sci., 2005, 54, 11, 609-612, https://doi.org/10.5650/jos.54.609
. [all data]
Ghannadi, Sajjadi, et al., 2004
Ghannadi, A.; Sajjadi, S.E.; Kabouche, A.; Kabouche, Z.,
Thymus fontanesii Boiss. Reut. - A Potential Source of Thymol-Rich Essential Oil in North Africa,
Z. Naturforsch., 2004, 59c, 187-189. [all data]
JAvidnia, Mojab, et al., 2004
JAvidnia, K.; Mojab, F.; Mojahedi, S.A.,
Chemical constituents of the essential oil of Stachys lavandulifolia Vahl from Iran,
Iranian J. Pharm. Res., 2004, 3, 61-63. [all data]
Kalvandi, Sefidkon, et al., 2004
Kalvandi, R.; Sefidkon, F.; Atri, M.; Mirza, M.,
Analysis of the essential oil of Thymus eriocalyx from Iran,
Flavour Fragr. J., 2004, 19, 4, 341-343, https://doi.org/10.1002/ffj.1312
. [all data]
Kalemba and Thiem, 2004
Kalemba, D.; Thiem, B.,
Constituents of the essential oils of four micropropagated Solidago species,
Flavour Fragr. J., 2004, 19, 1, 40-43, https://doi.org/10.1002/ffj.1271
. [all data]
Marongiu, Piras, et al., 2004
Marongiu, B.; Piras, A.; Porcedda, S.,
Comparative analysis of the oil and supercritical CO2 extract of Elettaria cardamomum (L.) maton,
J. Agric. Food Chem., 2004, 52, 20, 6278-6282, https://doi.org/10.1021/jf034819i
. [all data]
Orav, Stulova, et al., 2004
Orav, A.; Stulova, I.; Kailas, T.; Müürisepp, M.,
Effect of storage on the essential oil composition of piper nigrum L. fruits of different ripening states,
J. Agric. Food Chem., 2004, 52, 9, 2582-2586, https://doi.org/10.1021/jf030635s
. [all data]
Raal, Paaver, et al., 2004
Raal, A.; Paaver, U.; Arak, E.; Orav, A.,
Content and composition of the essential oil of Thymus serpyllum L. growing wild in Estonia,
Medicina (Kaunas), 2004, 40, 8, 795-800. [all data]
Rasooli and Razzaghi Abyaneh, 2004
Rasooli, I.; Razzaghi Abyaneh, M.,
Inhibitory effects of Thyme oils on growth and aflatoxin production by Aspergillus parasiticus,
Food Control, 2004, 15, 6, 479-483, https://doi.org/10.1016/j.foodcont.2003.07.002
. [all data]
Sadeghpour, Asghari, et al., 2004
Sadeghpour, O.; Asghari, G.; Ardekani, M.R.S.,
Composition of essential oil of Artemisia persica Boiss. from Iran,
Iran. J. Pharm. Res., 2004, 3, 65-67. [all data]
Sajjadi and Shahpiri, 2004
Sajjadi, S.E.; Shahpiri, Z.,
Chemical composition of the essential oil of Salvia limbata C.A.Mey,
DARU, 2004, 12, 3, 94-97. [all data]
Sefidkon, Jamzad, et al., 2004
Sefidkon, F.; Jamzad, Z.; Mirza, M.,
Chemical variation in the essential oil of Satureja sahendica from Iran,
Food Chem., 2004, 88, 3, 325-328, https://doi.org/10.1016/j.foodchem.2003.12.044
. [all data]
Senatore, Napolitano, et al., 2004
Senatore, F.; Napolitano, F.; Mohamed, M.A.-H.; Harris, P.J.C.; MnKeni, P.N.S.; Henderson, J.,
Antibacterial activity of Tagetes minuta L. (Asteraceae) essential oil with different chemical composition,
Flavour Fragr. J., 2004, 19, 6, 574-578, https://doi.org/10.1002/ffj.1358
. [all data]
Shafi, Nambiar, et al., 2004
Shafi, P.M.; Nambiar, M.K.G.; Clery, R.A.; Sarma, Y.R.; Veena, S.S.,
Composition and antifungal activity of the oil of Artemisia nilagirica (Clarke) Pamp,
J. Essent. Oil Res., 2004, 16, 4, 377-379, https://doi.org/10.1080/10412905.2004.9698748
. [all data]
Afsharypuor and Jahromy, 2003
Afsharypuor, S.; Jahromy, M.M.,
Constituents of the essential oil from Tanacetum lingulatum (Boiss.) Bornm.,
J. Essent. Oil Res., 2003, 15, 2, 74-76, https://doi.org/10.1080/10412905.2003.9712069
. [all data]
Cabanillas, Lopez, et al., 2003
Cabanillas, C.M.; Lopez, M.L.; Daniele, G.; Zygadlo, J.A.,
Essential oil composition of Aloysia polystachya (Griseb.) Moldenke under rust disease,
Flavour Fragr. J., 2003, 18, 5, 446-448, https://doi.org/10.1002/ffj.1249
. [all data]
Dabiri and Sefidkon, 2003
Dabiri, M.; Sefidkon, F.,
Chemical composition of the essential oil of Nepeta racemosa Lam. from Iran,
Flavour Fragr. J., 2003, 18, 2, 157-158, https://doi.org/10.1002/ffj.1151
. [all data]
Ebrahimzadeh, Yamini, et al., 2003
Ebrahimzadeh, H.; Yamini, Y.; Sefidkon, F.; Chaloosi, M.; Pourmortazavi, S.M.,
Chemical composition of the essential oil and supercritical CO2 extracts of Zataria multiflora Boiss,
Food Chem., 2003, 83, 3, 357-361, https://doi.org/10.1016/S0308-8146(03)00096-7
. [all data]
Edris and Farrag, 2003
Edris, A.E.; Farrag, E.S.,
Antifungal activity of peppermint and sweet basil essential oils and their major aroma constituents on some plant pathogenic fungi from the vapor phase,
Nahrung/Food, 2003, 47, 2, 117-121, https://doi.org/10.1002/food.200390021
. [all data]
Edris, Shalaby, et al., 2003
Edris, A.E.; Shalaby, A.; Fadel, H.M.,
Effect of organic agriculture practices on the volatile aroma components of some essential oil plants growing in Egypt II: sweet Marjoram (Origanum marjorana L.) essential oil,
Flavour Fragr. J., 2003, 18, 4, 345-351, https://doi.org/10.1002/ffj.1235
. [all data]
Feizbaksh, Saber Tehrani, et al., 2003
Feizbaksh, A.; Saber Tehrani, M.; Rustaiyan, A.; Masoudi, S.,
Composition of the essential oil of Stachys lavandulifolia Vahl. from Iran,
J. Essent. Oil Res., 2003, 15, 2, 72-73, https://doi.org/10.1080/10412905.2003.9712068
. [all data]
Ghannadi, Aghazari, et al., 2003
Ghannadi, A.; Aghazari, F.; Mehrabani, M.; Mohagheghzadeh, A.; Mehregan, I.,
Quantity and composition of the SDE prepared essential oil of Nepeta macrosiphon Boiss,
Iran. J. Pharm. Res., 2003, 2, 103-105. [all data]
Jirovetz, Buchbauer, et al., 2003
Jirovetz, L.; Buchbauer, G.; Shafi, M.P.; Leela, N.K.,
Analysis of the essential oils of the leaves, stems, rhizomes and roots of the medicinal plant Alpinia galanga from southern India,
Acta Pharm. Hung., 2003, 53, 73-81. [all data]
Machado, Zoghbi, et al., 2003
Machado, L.B.; Zoghbi, M.G.B.; Andrade, E.H.A.,
Seasonal variation in the composition of the essential oils rom the leaves, thin branches and resin of Protium spruceanum (Benth.) Engl.,
Flavour Fragr. J., 2003, 18, 4, 338-341, https://doi.org/10.1002/ffj.1238
. [all data]
Mahalwal and Ali, 2003
Mahalwal, V.S.; Ali, M.,
Volatile constituents of Cymbopogon nardus (Linn.) rendle,
Flavour Fragr. J., 2003, 18, 1, 73-76, https://doi.org/10.1002/ffj.1144
. [all data]
Maia, Taveira, et al., 2003
Maia, J.G.S.; Taveira, F.S.N.; Andrade, E.H.A.; da Silva, M.H.L.; Zoghbi, M.G.B.,
Essential oils of Lippia grandis Schau.,
Flavour Fragr. J., 2003, 18, 5, 417-420, https://doi.org/10.1002/ffj.1241
. [all data]
Masotti, Juteau, et al., 2003
Masotti, V.; Juteau, F.; Bessière, J.M.; Viano, J.,
Seasonal and phenological variations of the essential oil from the narrow endemic species Artemisia molinieri and its biological activities,
J. Agric. Food Chem., 2003, 51, 24, 7115-7121, https://doi.org/10.1021/jf034621y
. [all data]
Mierendorff, Stahl-Biskup, et al., 2003
Mierendorff, H.-G.; Stahl-Biskup, E.; Posthumus, M.A.; van Beek, T.A.,
Composition of commercial Cape chamomile oil (Eriocephalus punctulatus),
Flavour Fragr. J., 2003, 18, 6, 510-514, https://doi.org/10.1002/ffj.1259
. [all data]
Mookdasanit, Tamura, et al., 2003
Mookdasanit, J.; Tamura, H.; Yoshizawa T.; Tokunaga T.; Nakanishi, K.,
Trace Volatile Compounds in Essential Oil of Citrus Sudachi by Means of Modified Solvent Extraction Method,
Food Sci Technol. Res., 2003, 9, 1, 54-61, https://doi.org/10.3136/fstr.9.54
. [all data]
Perez-Alonso, Velasco-Negueruela, et al., 2003
Perez-Alonso, M.J.; Velasco-Negueruela, A.; Palá-Paúl, J.; Sanz, J.,
Variations in the essential oil composition of Artemisia pedemontana gathered in Spain: chemotype camphor-1,8-cineole and chemotype davanone,
Biochem. Syst. Ecol., 2003, 31, 1, 77-84, https://doi.org/10.1016/S0305-1978(02)00082-0
. [all data]
Pino, Marbot, et al., 2003
Pino, J.A.; Marbot, R.; Fuentes, V.,
Characterization of volatiles in Bullock's heart (Annona reticulata L.) fruit cultivars from Cuba,
J. Agric. Food Chem., 2003, 51, 13, 3836-3839, https://doi.org/10.1021/jf020733y
. [all data]
Pitarokili, Tzakou, et al., 2003
Pitarokili, D.; Tzakou, O.; Loukis, A.; Harvala, C.,
Volatile metabolites from Salvia fruticosa as antifungal agents in soilborne pathogens,
J. Agric. Food Chem., 2003, 51, 11, 3294-3301, https://doi.org/10.1021/jf0211534
. [all data]
Rasooli and Mirmostafa, 2003
Rasooli, I.; Mirmostafa, S.A.,
Bacterial susceptibility to and chemical composition of essential oils from Thymus kotschyanus and Thymus persicus,
J. Agric. Food Chem., 2003, 51, 8, 2200-2205, https://doi.org/10.1021/jf0261755
. [all data]
Sajjadi and Mehregan, 2003
Sajjadi, S.E.; Mehregan, I.,
Chemical composition of the essential oil of Prangos Asperula Boiss. subsp. haussknechtii (Boiss.) Hernst. et Heyn fruits, 2003, retrieved from http://www1.tums.ac.ir/daru/daru2%2020003/Dr%20Sajadi.PDF. [all data]
Shahmir, Ahmadi, et al., 2003
Shahmir, F.; Ahmadi, L.; Mirza, M.; Korori, S.A.A.,
Secretory elements of needles and berries of Juniperus communis L. ssp. communis and its volatile constituents,
Flavour Fragr. J., 2003, 18, 5, 425-428, https://doi.org/10.1002/ffj.1243
. [all data]
Bos, Koulman, et al., 2002
Bos, R.; Koulman, A.; Woerdenbag, H.J.; Quax, W.J.; Pras, N.,
Volatile components from Anthriscus sylvestris (L.) Hoffm.,
J. Chromatogr. A, 2002, 966, 1-2, 233-238, https://doi.org/10.1016/S0021-9673(02)00704-5
. [all data]
Cicció and Gómez-Laurito, 2002
Cicció, J.F.; Gómez-Laurito, J.,
Volatile constituents of the leaves of Siparuna thecaphora (Siparunaceae) from Turrialba, Costa Rica,
Rev. Biol. Trop., 2002, 50, 3/4, 963-967. [all data]
Jirovetz, Buchbauer, et al., 2002
Jirovetz, L.; Buchbauer, G.; Ngassoum, M.B.; Geissler, M.,
Aroma compound analysis of Piper nigrum and Piper guineense essential oils from Cameroon using solid-phase microextraction-gas chromatography, solid-phase microextraction-gas chromatography-mass spectrometry and olfactometry,
J. Chromatogr. A, 2002, 976, 1-2, 265-275, https://doi.org/10.1016/S0021-9673(02)00376-X
. [all data]
Kobaisy, Tellez, et al., 2002
Kobaisy, M.; Tellez, M.R.; Dayan, F.E.; Duke, S.O.,
Phytotoxicity and volatile constituents from leaves of Callicarpa japonica Thunb.,
Phytochemistry, 2002, 61, 1, 37-40, https://doi.org/10.1016/S0031-9422(02)00207-8
. [all data]
Maia, Zoghbi, et al., 2002
Maia, J.G.S.; Zoghbi, M.G.B.; Andrade, E.H.A.; da Silva, M.H.L.; Luz, A.I.R.; da Silva, J.D.,
Essential oils composition of Eupatorium species growing wild in the Amazon,
Biochem. Syst. Ecol., 2002, 30, 11, 1071-1077, https://doi.org/10.1016/S0305-1978(02)00059-5
. [all data]
Novak, Langbehn, et al., 2002
Novak, J.; Langbehn, J.; Pank, F.; Franz. C.M.,
Essential oil compounds in a historical sample of marjoram (Origanum majorana L., Lamiaceae),
Flavour Fragr. J., 2002, 17, 3, 175-180, https://doi.org/10.1002/ffj.1077
. [all data]
Palá-Paúl, Pérez-Alonso, et al., 2002
Palá-Paúl, J.; Pérez-Alonso, M.J.; Velasco-Negueruela, A.; Sanz, J.,
Analysis by gas chromatography-mass spectrometry of the volatile components of Ageratina adenophora Spreng., growing in the Canary Islands,
J. Chromatogr. A, 2002, 947, 2, 327-331, https://doi.org/10.1016/S0021-9673(02)00016-X
. [all data]
Sefidkon, Jalili, et al., 2002
Sefidkon, F.; Jalili, A.; Mirhaji, T.,
Essential oil composition of three Artemisia spp. from Iran,
Flavour Fragr. J., 2002, 17, 2, 150-152, https://doi.org/10.1002/ffj.1063
. [all data]
Sefidkon, 2002
Sefidkon, F.,
Essential oil of Lantana camara L. occurring in Iran,
Flavour Fragr. J., 2002, 17, 1, 78-80, https://doi.org/10.1002/ffj.1048
. [all data]
Zoghbi, Andrade, et al., 2002
Zoghbi, M.G.B.; Andrade, E.H.A.; da Silva, M.H.L.; Maia, J.G.S.,
Volatile constituents of Lippia lupulina Cham.,
Flavour Fragr. J., 2002, 17, 1, 29-31, https://doi.org/10.1002/ffj.1032
. [all data]
Zoghbi, Andrade, et al., 2002, 2
Zoghbi, M.G.B.; Andrade, E.H.A.; da Silva, M.H.; Maia, J.G.S.; Luz, A.I.R.; da Silva, J.D.,
Chemical variation in the essential oils of Hyptis crenata Pohl ex Benth.,
Flavour Fragr. J., 2002, 17, 1, 5-8, https://doi.org/10.1002/ffj.1031
. [all data]
Cherchi, Deidda, et al., 2001
Cherchi, G.; Deidda, D.; de Gioannis, B.; Marongiu, B.; Pompei, R.; Porcedda, S.,
Extraction of Santolina insularis essential oil by supercritical carbon dioxide: influence of some process parameters and biological activity,
Flavour Fragr. J., 2001, 16, 1, 35-43, https://doi.org/10.1002/1099-1026(200101/02)16:1<35::AID-FFJ942>3.0.CO;2-Y
. [all data]
Dabiri and Sefidkon, 2001
Dabiri, M.; Sefidkon, F.,
Analysis of the essential oil from aerial parts of Perovskia atriplicifolia Benth. at different stages of plant growth,
Flavour Fragr. J., 2001, 16, 6, 435-438, https://doi.org/10.1002/ffj.988
. [all data]
Fernando and Grün, 2001
Fernando, L.N.; Grün, I.U.,
Headspace-SPME analysis of volatiles of the ridge gourd (Luffa acutangula) and bitter gourd (Momordica charantia) flowers,
Flavour Fragr. J., 2001, 16, 4, 289-293, https://doi.org/10.1002/ffj.999
. [all data]
Gallori, Flamini, et al., 2001
Gallori, S.; Flamini, G.; Bilia, A.R.; Morelli, I.; Landini, A.; Vincieri, F.F.,
Chemical composition of some traditional herbal drug preparations: essential oil and aromatic water of costmary (Balsamita suaveolens Pers.),
J. Agric. Food Chem., 2001, 49, 12, 5907-5910, https://doi.org/10.1021/jf0107656
. [all data]
Lota, de Rocca Serra, et al., 2001
Lota, M.-L.; de Rocca Serra, D.; Tomi, F.; Casanova, J.,
Chemical variability of peel and leaf essential oils of 15 species of mandarins,
Biochem. Syst. Ecol., 2001, 29, 1, 77-104, https://doi.org/10.1016/S0305-1978(00)00029-6
. [all data]
Marongiu, Porcedda, et al., 2001
Marongiu, B.; Porcedda, S.; Porta, G.D.; Reverchon, E.,
Extraction and isolation of Salvia desoleana and Mentha spicata subsp. insularis essential oils by supercritical CO2,
Flavour Fragr. J., 2001, 16, 5, 384-388, https://doi.org/10.1002/ffj.1021
. [all data]
Mirza, Ahmadi, et al., 2001
Mirza, M.; Ahmadi, L.; Tayebi, M.,
Volatile constituents of Hymenocrater incanus Bunge, an Iranian endemic species,
Flavour Fragr. J., 2001, 16, 4, 239-240, https://doi.org/10.1002/ffj.983
. [all data]
Orav and Kann, 2001
Orav, A.; Kann, J.,
Determination of peppermint and orange aroma compounds in food and beverages,
Proc. Est. Acad. Sci. Chem., 2001, 50, 4, 217-225. [all data]
Yang, 2001
Yang, R.,
Volatile compounds in peel oil of Citrus sudachi,
Food Sci. (Beijing), 2001, 22, 3, 71-73. [all data]
Asekun and Ekundayo, 2000
Asekun, O.T.; Ekundayo, O.,
Essential oil constituents of Hyptis suaveolens (L.) Poit. (Bush tea) leaves from Nigeria,
J. Essent. Oil Res., 2000, 12, 227-230. [all data]
Mallavarapu, Rao, et al., 2000
Mallavarapu, G.R.; Rao, L.; Ramesh, S.,
Volatile constituents of the leaf and fruit oils of Murraya koenigii Spreng.,
L. Ess. Oil Res., 2000, 12, 6, 766-768, https://doi.org/10.1080/10412905.2000.9712211
. [all data]
Mohagheghzadeh, Shams-Ardakani, et al., 2000
Mohagheghzadeh, A.; Shams-Ardakani, M.; Ghannadi, A.,
Linalol-rich essential oil of Zataria multiflora Boiss. (Lamiaceae),
Flavour Fragr. J., 2000, 15, 2, 119-122, https://doi.org/10.1002/(SICI)1099-1026(200003/04)15:2<119::AID-FFJ878>3.0.CO;2-V
. [all data]
Mohagheghzadeh, Shams-Ardakani, et al., 2000, 2
Mohagheghzadeh, A.; Shams-Ardakani, M.; Ghannadi, A.,
Volatile constituents of callus and flower-bearing tops of Zataria multiflora Boiss. (Lamiaceae),
Flavour Fragr. J., 2000, 15, 6, 373-376, https://doi.org/10.1002/1099-1026(200011/12)15:6<373::AID-FFJ923>3.0.CO;2-9
. [all data]
Kalemba, 1999
Kalemba, D.,
Constituents of the essential oil of Artemisia asiatica Nakai,
Flavour Fragr. J., 1999, 14, 3, 173-176, https://doi.org/10.1002/(SICI)1099-1026(199905/06)14:3<173::AID-FFJ805>3.0.CO;2-Q
. [all data]
Koulman, 1999
Koulman, A.,
Podophyllotoxin: a study of biosynthesis, evolution, function, and use of podophyllotoxin and related lignans, University Library Groningen, Nederlands, 1999, 188, retrieved from http://www.ub.rug.nl/eldoc/dis/science/a.koulman/. [all data]
Labuckas, Zygadlo, et al., 1999
Labuckas, D.O.; Zygadlo, J.A.; Faillaci, S.M.; Espinar, L.A.,
Constituents of the volatile oil of Porophyllum obscurum (Spreng.) D.C.,
Flavour Fragr. J., 1999, 14, 2, 107-108, https://doi.org/10.1002/(SICI)1099-1026(199903/04)14:2<107::AID-FFJ799>3.0.CO;2-E
. [all data]
Oberhofer, Nikiforov, et al., 1999
Oberhofer, B.; Nikiforov, A.; Buchbauer, G.; Jirovetz, L.; Bicchi, C.,
Investigation of the alteration of the composition of various essential oils used in aroma lamp applications,
Flavour Fragr. J., 1999, 14, 5, 293-299, https://doi.org/10.1002/(SICI)1099-1026(199909/10)14:5<293::AID-FFJ829>3.0.CO;2-T
. [all data]
Prikhod'ko, Klyuev, et al., 1999
Prikhod'ko, A.B.; Klyuev, N.A.; Volkovich, S.V.; Emets, T.I.; Petrenko, V.V.; Dolya, E.V.,
Component composition od the essential oil of Thymus dimorphus,
Chem. Nat. Comp., 1999, 35, 1, 46-51, https://doi.org/10.1007/BF02238208
. [all data]
Rao, Bhattacharya, et al., 1999
Rao, B.R.R.; Bhattacharya, A.K.; Mallavarapu, G.R.; Ramesh, S.,
Volatile constituents of different parts of cornmint (Mentha arvensis L.),
Flavour Fragr. J., 1999, 14, 5, 262-264, https://doi.org/10.1002/(SICI)1099-1026(199909/10)14:5<262::AID-FFJ766>3.0.CO;2-6
. [all data]
Rustaiyan and Nadji, 1999
Rustaiyan, A.; Nadji, K.,
Composition of the essential oils of Nepeta ispahanica Boiss. and Nepeta binaludensis Jamzad from Iran,
Flavour Fragr. J., 1999, 14, 1, 35-37, https://doi.org/10.1002/(SICI)1099-1026(199901/02)14:1<35::AID-FFJ776>3.0.CO;2-N
. [all data]
Sefidkon, Dabiri, et al., 1999
Sefidkon, F.; Dabiri, M.; Rahimi-Bidgoly, A.,
The effect of distillation methods and stage of plant growth on the essential oil content and composition of Thymus kotschyanus Boiss. Hohen,
Flavour Fragr. J., 1999, 14, 6, 405-408, https://doi.org/10.1002/(SICI)1099-1026(199911/12)14:6<405::AID-FFJ853>3.0.CO;2-M
. [all data]
Sefidkon and Mirza, 1999
Sefidkon, F.; Mirza, M.,
Chemical composition of the essential oils of two Salvia species from Iran, Salvia virgata Jacq. and Salvia syriaca L.,
Flavour Fragr. J., 1999, 14, 1, 45-46, https://doi.org/10.1002/(SICI)1099-1026(199901/02)14:1<45::AID-FFJ774>3.0.CO;2-S
. [all data]
Tellez, Canel, et al., 1999
Tellez, M.R.; Canel, C.; Rimando, A.M.; Duke, S.O.,
Differential accumulation of isoprenoids in glanded and glandless Artemisia annua L,
Phytochemistry, 1999, 52, 6, 1035-1040, https://doi.org/10.1016/S0031-9422(99)00308-8
. [all data]
Tropnikova, Zenkevich, et al., 1999
Tropnikova, I.V.; Zenkevich, I.G.; Budantsev, A.L.,
Composition of Essential Oil Nepeta cataria L. var. Citriodora Beck and Features of its Determination,
Rastit. Resursy (Rus.), 1999, 2, 64-69. [all data]
Zoghbi, Andrade, et al., 1999
Zoghbi, M.G.B.; Andrade, E.H.A.; Maia, J.G.S.,
The essential oil of Vitex angus-castus L. growing in the Amazon region,
Flavour Fragr. J., 1999, 14, 4, 211-213, https://doi.org/10.1002/(SICI)1099-1026(199907/08)14:4<211::AID-FFJ812>3.0.CO;2-W
. [all data]
Zoghbi, Andrade, et al., 1999, 2
Zoghbi, M.G.B.; Andrade, E.H.A.; Maia, J.G.S.,
Volatile constituents from leaves and flowers of Alpinia speciosa K. Schum. and A. purpurata (Viell.) Schum.,
Flavour Fragr. J., 1999, 14, 6, 411-414, https://doi.org/10.1002/(SICI)1099-1026(199911/12)14:6<411::AID-FFJ854>3.0.CO;2-U
. [all data]
Maia, Zohhbi, et al., 1998
Maia, J.G.S.; Zohhbi, M.G.B.; Andrade, E.H.A.; Santos, A.S.; da Silva, M.H.L.; Luz, A.I.R.; Bastos, C.N.,
Constituents of the essential oil of Piper aduncum L. growing wild in the Amazon region,
Flavour Fragr. J., 1998, 13, 4, 269-272, https://doi.org/10.1002/(SICI)1099-1026(1998070)13:4<269::AID-FFJ744>3.0.CO;2-A
. [all data]
Poiana, Sicari, et al., 1998
Poiana, M.; Sicari, V.; Mincione, B.,
Supercritical carbon dioxide (SC-CO2) extraction of grapefruit flavedo,
Flavour Fragr. J., 1998, 13, 2, 125-130, https://doi.org/10.1002/(SICI)1099-1026(199803/04)13:2<125::AID-FFJ708>3.0.CO;2-#
. [all data]
Stashenko, Cervantes, et al., 1998
Stashenko, E.E.; Cervantes, M.; Combariza, Y.; Martínez, J.R.,
HRGC-FID-MSD Analysis of the Secondary Metabolites Obtained by Different Extraction Methods from Lepechinia schiedeana, and Evaluation of its Antioxidant Activity in vitro
in 20th International Symposium on Capillary Chromatography, 1998, 1-11. [all data]
Mariaca, Berger, et al., 1997
Mariaca, R.G.; Berger, T.F.H.; Gauch, R.; Imhof, M.I.; Jeangros, B.; Bosset, J.O.,
Occurrence of volatile mono- and sesquiterpenoids in highland and lowland plant species as possible precursors for flavor compounds in milk and dairy products,
J. Agric. Food Chem., 1997, 45, 11, 4423-4434, https://doi.org/10.1021/jf970216t
. [all data]
Salgueiro, Vila, et al., 1997
Salgueiro, L.R.; Vila, R.; Tomi, F.; Figueiredo, A.C.; Barroso, J.G.; Cañigueral, S.; Casanova, J.; da Cunha, A.P.; Adzet, T.,
Variability of essential oils of Thymus caespititius from Portugal,
Phytochemistry, 1997, 45, 2, 307-311, https://doi.org/10.1016/S0031-9422(96)00872-2
. [all data]
Ayedoun, Adeoti, et al., 1996
Ayedoun, A.M.; Adeoti, B.S.; Sossou, P.V.; Leclerq, P.A.,
Influence of fruit conservation methods on the essential oil composition of xylopia aethiopica (Dunal) A. Richard from Benin,
Flavour Fragr. J., 1996, 11, 4, 245-250, https://doi.org/10.1002/(SICI)1099-1026(199607)11:4<245::AID-FFJ583>3.0.CO;2-K
. [all data]
Sagrero-Nieves and Bartley, 1996
Sagrero-Nieves, L.; Bartley, J.P.,
Volatile components from the leaves of heterotheca inuloides Cass.,
Flavour Fragr. J., 1996, 11, 1, 49-51, https://doi.org/10.1002/(SICI)1099-1026(199601)11:1<49::AID-FFJ538>3.0.CO;2-J
. [all data]
Wong and Lai, 1996
Wong, K.C.; Lai, F.Y.,
Volatile constituents from the fruits of four Syzygium species grown in Malaysia,
Flavour Fragr. J., 1996, 11, 1, 61-66, https://doi.org/10.1002/(SICI)1099-1026(199601)11:1<61::AID-FFJ539>3.0.CO;2-1
. [all data]
Tirado, Stashenko, et al., 1995
Tirado, C.B.; Stashenko, E.E.; Combariza, M.Y.; Martinez, J.R.,
Comparative study of Colombian citrus oils by high-resolution gas chromatography and gas chromatography-mass spectrometry,
J. Chromatogr. A, 1995, 697, 1-2, 501-513, https://doi.org/10.1016/0021-9673(94)00955-9
. [all data]
Gopalakrishnan, Menon, et al., 1993
Gopalakrishnan, M.; Menon, N.; Padmakumari, K.P.; Jayalekshmy, A.; Narayanan, C.S.,
GC Analysis and Odor Profiles of Four New Indian Genotypes of Piper nigrum L.,
J. Essent. Oil Res., 1993, 5, 3, 247-253, https://doi.org/10.1080/10412905.1993.9698217
. [all data]
Kaul, Singh, et al., 1993
Kaul, V.K.; Singh, B.; Sood, R.P.,
Volatile Constituents of the Essential Oil of Tanacetum longifolium Wall.,
J. Essent. Oil Res., 1993, 5, 6, 597-601, https://doi.org/10.1080/10412905.1993.9698290
. [all data]
Tamura, Yang, et al., 1993
Tamura, H.; Yang, R.-H.; Sugisawa, H.,
Aroma profiles of peel oils of acid citrus,
ACS Sym. Ser., 1993, 525, 121-136. [all data]
Kollmannsberger, Nitz, et al., 1992
Kollmannsberger, H.; Nitz, S.; Drawert, F.,
UBer die Aromastoffzusammensetzung von Hochdruckextrakten. I. Pfeffer (Piper nigrum, Var. muntok),
Z. Lebensm. Unters Forsch., 1992, 194, 6, 545-551, https://doi.org/10.1007/BF01185481
. [all data]
Brophy, Davies, et al., 1989
Brophy, J.J.; Davies, N.W.; Southwell, I.A.; Stiff, I.A.; Williams, L.R.,
Gas chromatographic quality control for oil of Melaleuca terpinen-4-ol type (Australian tea tree),
J. Agric. Food Chem., 1989, 37, 5, 1330-1335, https://doi.org/10.1021/jf00089a027
. [all data]
de Pooter, de Buyck, et al., 1989
de Pooter, H.L.; de Buyck, L.F.; Schamp, N.M.; Billiet, F.; De Bruyn, A.,
The volatile fraction of Otacanthus coeruleus Lindl. Containing the new copaene derivative β-copaen-4α-ol,
Flavour Fragr. J., 1989, 4, 2, 47-51, https://doi.org/10.1002/ffj.2730040202
. [all data]
Sugisawa, Yamamoto, et al., 1989
Sugisawa, H.; Yamamoto, M.; Tamura, H.; Takagi, N.,
The comparison of volatile components in peel oil from four species of navel orange,
Nippon Shokuhin Kogio Gakkaishi, 1989, 36, 6, 455-462, https://doi.org/10.3136/nskkk1962.36.6_455
. [all data]
Sugisawa, Yang, et al., 1989
Sugisawa, H.; Yang, R.H.; Kawabata, C.; Tamura, H.,
Volatile constituents in the peel oil of sudachi (Citrus sudachi),
Agric. Biol. Chem., 1989, 53, 6, 1721-1723, https://doi.org/10.1271/bbb1961.53.1721
. [all data]
de Pooter, Nicolai, et al., 1988
de Pooter, H.L.; Nicolai, B.; De Laet, J.; De Buyck, L.F.; Schamp, N.M.; Goetghebeur, P.,
The Essential Oils of Five Nepeta Species. A Preliminary Evaluation of their Use in Chemotaxonomy by Cluster Analysis,
Flavour Fragr. J., 1988, 3, 4, 155-159, https://doi.org/10.1002/ffj.2730030404
. [all data]
Nykanen, 1986
Nykanen, I.,
High Resolution Gas Chromatographic - Mass Spectrometric determination of the Flavour Composition of Wild Majoram (Origanum vulgare L.) Cultivated in Finland,
Z. Lebensm Unters Forsch, 1986, 183, 4, 267-272, https://doi.org/10.1007/BF01087742
. [all data]
de Pooter, de Buyck, et al., 1986
de Pooter, H.L.; de Buyck, L.F.; Schamp, N.M.; Aboutabl, E.; De Bruyn, A.; Husain, S.Z.,
The Volatile Fraction of Senecio glaucus subsp. coronopifolius,
Flavour Fragr. J., 1986, 1, 4-5, 159-163, https://doi.org/10.1002/ffj.2730010406
. [all data]
De Pooter, De Buyck, et al., 1986
De Pooter, H.L.; De Buyck, L.F.; Schamp, N.M.,
The Volatiles of Calamintha Nepeta Subsp. Glandulosa,
Phytochemistry, 1986, 25, 3, 691-694, https://doi.org/10.1016/0031-9422(86)88025-6
. [all data]
Courtois, Paine, et al., 2009
Courtois, E.A.; Paine, C.E.; Blandinieres, P.-A.; Stien, D.; Bessiere, J.-M.; Houel, E.; Baraloto, C.; Chave, J.,
Diversity of the volatile organic compounds emitted by 55 species of tropical trees: a survey in French Guiana,
J. Chem. Ecol., 2009, 35, 11, 1349-1362, https://doi.org/10.1007/s10886-009-9718-1
. [all data]
Delort and Jaquier, 2009
Delort, E.; Jaquier, A.,
Novel terpenyl esters from Australian finger lime (Citrus australasica) peel extract,
Flav. Fragr. J., 2009, 24, 3, 123-132, https://doi.org/10.1002/ffj.1922
. [all data]
Kapoor, Singh, et al., 2009
Kapoor, I.; Singh, B.; Singh, G.; De Heluani, C.S.; De Lampasona, M.P.; Catalan, C.A.N.,
Chemistry and in vitro antioxidant activity of volatile oil and oleoresins of black pepper (Piper nigrum),
J. Agric. Food Chem., 2009, 57, 12, 5358-5364, https://doi.org/10.1021/jf900642x
. [all data]
Mendes, Trindade, et al., 2009
Mendes, M.D.; Trindade, H.; Figueiredo, A.C.; Pedro, L.G.; Barroso, J.G.,
Chaerophyllum azoricun Trel. grown in the Azores archipelago, Portugal: evaluation of the genetic diversity using molecular markers and comparison with volatile oils profiles,
Flavour Fragr. J., 2009, 24, 5, 259-265, https://doi.org/10.1002/ffj.1939
. [all data]
Mendes, Trindade, et al., 2009, 2
Mendes, M.D.; Trindade, H.; Figueiredo, A.C.; Barroso, J.G.; Fontinha, S.S.; Pedro, L.G.,
Volatile and molecular characterization of two Portuguese endemic species: Angelica lignescens and Melanoselinium decipiens,
Biochen. Systematics Ecol., 2009, 37, 2, 98-105, https://doi.org/10.1016/j.bse.2008.12.006
. [all data]
Riahi, Pourbasheer, et al., 2009
Riahi, S.; Pourbasheer, E.; Ganjali, M.R.; Norouzi, P.,
Investigation of different linear and non-linear chemometric methods for modeling of retention index of essential oil components: Concerns to support vector mashine,
J. Hazard. Mat., 2009, 166, 2-3, 853-859, https://doi.org/10.1016/j.jhazmat.2008.11.097
. [all data]
Costa, De Fina, et al., 2008
Costa, R.; De Fina, M.R.; Valentino, M.R.; Rustaiyan, A.; Dugo, P.; Dugo, G.; Mondello, L.,
An investigation on the volatile composition of some Artemisia species from Iran,
Flavour Fragr. J., 2008, 24, 2, 75-82, https://doi.org/10.1002/ffj.1919
. [all data]
Ferreira, Meireles de Sousa, et al., 2007
Ferreira, N.J.; Meireles de Sousa, I.G.; Luís, T.C.; Currais, A.J.M.; Figueiredo, C.; Cost, M.M.; Lima, A.S.B.; Santos, P.A.G.; Barroso, J.G.; Pedro, L.G.; Scheffer, J.J.C.,
Pittosporum undulatum Vent. grown in Portugal: secretory structures, seasonal variation and enantiomeric composition of its essential oil,
Flavour Fragr. J., 2007, 22, 1, 1-9, https://doi.org/10.1002/ffj.1748
. [all data]
Radusiene, Judzentiene, et al., 2007
Radusiene, J.; Judzentiene, A.; Peciulyte, D.; Janulis, V.,
Essential Oil Composition and Antimicrobial Assay of Acorus calamus Leaves from Different Wild Populations,
Plant Genetic Resources: Characterization and Utilization, 2007, 5, 1, 37-44, https://doi.org/10.1017/S1479262107390928
. [all data]
Werka, Boehme, et al., 2007
Werka, J.S.; Boehme, A.K.; Setzer, W.N.,
Biological activities of essential oils from Monteverde, Costa Rica,
Natural Product Communications, 2007, 2, 12, 1215-1219. [all data]
Baris, Güllüce, et al., 2006
Baris, Ö.; Güllüce, M.; Sahin, F.; Özer, H.; Kilic, H.; Özkan, H.; Sökmen, M.; Özbek, T.,
Biological Activities of the Essential Oil and Methanol Extract of Achillea biebersteinii Afan. (Asteraceae),
Turk. J. Biol., 2006, 30, 65-73. [all data]
Chemat, Lucchesi, et al., 2006
Chemat, F.; Lucchesi, M.E.; Smadja, J.; Favretto, L.; Colnaghi, G.; Visinoni, F.,
Microwave accelerated steam distillation of essential oil from lavender: A rapid, clean and environmentally friendly approach,
Anal. Chim. Acta., 2006, 555, 1, 157-160, https://doi.org/10.1016/j.aca.2005.08.071
. [all data]
Figueiredo A.C., Barroso J.G., et al., 2006
Figueiredo A.C.; Barroso J.G.; Pedro L.G.; Fontinha S.S.; Sim-Sim M.; Sergio C.; Luis L.; Scheffers J.J.C.,
Asterella africana (Mont.) A. Evans grown on Madeira and in mainland Portugal: morphological data and composition of the essential oil,
Flavour Fragr. J., 2006, 21, 3, 534-538, https://doi.org/10.1002/ffj.1611
. [all data]
Iriti, Colnaghi, et al., 2006
Iriti, M.; Colnaghi, G.; Chemat, F.; Smadja, J.; Faoro, F.; Visinoni, F.A.,
Histo-cytochemistry and scanning electron microscopy of lavender glandular trichomes following conventional and microwave-assisted hydrodistillation of essential oils: a comparative study,
Flavour Fragr. J., 2006, 21, 4, 704-712, https://doi.org/10.1002/ffj.1692
. [all data]
Judzentiene and Buzelyte, 2006
Judzentiene, A.; Buzelyte, J.,
Chemical composition of essential oils of Artemisia vulgaris L. (mugwort) from North Lithuania,
Chemija, 2006, 17, 1, 12-15. [all data]
Martinez, Madrid, et al., 2006
Martinez, S.; Madrid, J.; Hernández, F.; Megias, M.D.; Sotomayor, J.A.; Jordan, M.J.,
Effect of thyme essential oils (Thymus hyemalis and Thymus zygis) and Monensin on in Vitro Ruminal degradation and volatile fatty acid production,
J. Agric. Food Chem., 2006, 54, 18, 6598-6602, https://doi.org/10.1021/jf060985p
. [all data]
Mockute, Bernotiene, et al., 2006
Mockute, D.; Bernotiene, G.; Judzentiene, A.,
Germacrene D chemotype of essential oils of Leonurus cardiaca L. growing wild in Vilnus district (Lithuania),
J. Essent. Oil Res., 2006, 18, 5, 566-568, https://doi.org/10.1080/10412905.2006.9699169
. [all data]
Srivastava, Mallavarapu, et al., 2006
Srivastava, S.; Mallavarapu, G.R.; Rai, S.K.; Singh, D.; Mishra, R.; Pandey-Rai, S.; Kumar, S.,
Composition of the essential oils of the leaves and flowers of Rhus mysurensis Heyne ex Wight Arn growing in the Aravalli mountain range at New Delhi,
Flavour Fragr. J., 2006, 21, 2, 228-229, https://doi.org/10.1002/ffj.1561
. [all data]
Tognolini, Barocelli, et al., 2006
Tognolini, M.; Barocelli, E.; Ballabeni, V.; Bruni, R.; Bianchi, A.; Chiavarini, M.; Impicciatore, M.,
Comparative screening of plant essential oils: Phenylpropanoid moiety as basic core for antiplatelet activity,
Life Sciences, 2006, 78, 13, 1419-1432, https://doi.org/10.1016/j.lfs.2005.07.020
. [all data]
Al-Burtamani, Fatope, et al., 2005
Al-Burtamani, S.K.S.; Fatope, M.O.; Marwah, R.G.; Onifade, A.K.; Al-Saidi, S.H.,
Chemical composition, antibacterial and antifungal activities of the essential oil of Haplophyllum tuberculatum from Oman,
J. Ethnopharmacol., 2005, 96, 1-2, 107-112, https://doi.org/10.1016/j.jep.2004.08.039
. [all data]
Bagci and Baser, 2005
Bagci, E.; Baser, K.H.C.,
Study of the essential oils of Thymus haussknechtii Velen and Thymus kotschyanus Boiss. et Hohen var. kotschyanus (Lamiaceae) taxa from the eastern Anatolian region in Turkey,
Flavour Fragr. J., 2005, 20, 2, 199-202, https://doi.org/10.1002/ffj.1397
. [all data]
Butkienë, Nivinskienë, et al., 2005
Butkienë, R.; Nivinskienë, O.; Mockutë, D.,
α-Pinene chemotype of leaf (needle) essential oils of Juniperus communis L. growing wild in Vilnius district,
Chemija, 2005, 16, 1, 53-60. [all data]
Faleio, Miguel, et al., 2005
Faleio, L.; Miguel, G.; Gomes, S.; Costa, L.; Venancio, F.; Teixeira, A.; Figueiredo, A.C.; Barroso, J.G.; Pedro, L.G.,
Antibacterial and Antioxidant Activities of Essential Oils Isolated from Thymbra capitata L. (Cav.) and Origanum vulgare L.,
J. Agric. Food Chem., 2005, 53, 21, 8162-8168, https://doi.org/10.1021/jf0510079
. [all data]
Figueiredo, Sim-Sim, et al., 2005
Figueiredo, A.C.; Sim-Sim, M.; Costa, M.M.; Barroso, J.G.; Pedro, L.G.; Esquível, M.G.; Gutierres, F.; Lobo, C.; Fontinha, S.,
Comparison of the essential oil composition of four Plagiochila species: P. bifaria, P. maderensis, P. retrorsa and P. stricta,
Flavour Fragr. J., 2005, 20, 6, 703-709, https://doi.org/10.1002/ffj.1627
. [all data]
Novak, Draxler, et al., 2005
Novak, J.; Draxler, L.; Göhler, I.; Franz, C.M.,
Essential oil composition of Vitex agnus-castus - comparison of accessions and different plant organs,
Flavour Fragr. J., 2005, 20, 2, 186-192, https://doi.org/10.1002/ffj.1404
. [all data]
Omidbaigi and Bastan, 2005
Omidbaigi, R.; Bastan, M.R.,
Essential oil content and composition of marjoram cultivated in north of Iran,
JEOBP, 2005, 8, 1, 56-60. [all data]
Radudienë, Judpintienë, et al., 2005
Radudienë, J.; Judpintienë, A.; Peèiulytë, D.; Janulis, V.,
Chemical composition of essential oil and antimicrobial activity of Origanum vulgare,
Biologija, 2005, 4, 53-58. [all data]
Singh, Maurya, et al., 2005
Singh, G.; Maurya, S.; Catalan, C.; de Lampasona, M.P.,
Studies on essential oils, Part 42: chemical, antifungal, antioxidant and sprout suppressant studies on ginger essential oil and its oleoresin,
Flavour Fragr. J., 2005, 20, 1, 1-6, https://doi.org/10.1002/ffj.1373
. [all data]
Albuquerque, Souza, et al., 2004
Albuquerque, M.R.J.R.; Souza, E.B.; Lins, M.U.D.S.; Nogueira, N.A.P.; Lemos, T.L.G.; Silveira, E.R.; Pessoa, O.D.L.,
Composition and antimicrobial activity of the essential oil from aerial parts of Baccharis trinervis (Lam.) Pers.,
Arkivoc, 2004, 6, 6, 59-65, https://doi.org/10.3998/ark.5550190.0005.608
. [all data]
Judpentienë and Mockutë, 2004
Judpentienë, A.; Mockutë, D.,
Chemical composition of essential oils of Artemisia absinthium L. (wormwood) growing wild in Vilnius,
Chemija, 2004, 15, 4, 64-68. [all data]
Koba, Sanda, et al., 2004
Koba, K.; Sanda, K.; Raynaud, C.; Nenonene, Y.A.; Millet, J.; Chaumont, J.P.,
Activités antimicrobiennes d'huiles essentielles de trois Cymbopogon sp. africains vis-àvis de germes pathogènes d'animaux de compagnie,
Ann. Med. Vet., 2004, 148, 202-206. [all data]
Miguel, Simões, et al., 2004
Miguel, G.; Simões, M.; Figueiredo, A.C.; Barroso, J.G.; Pedro, L.G.; Carvalho, L.,
Composition and antioxidant activities of the essential oils of Thymus caespititius, Thymus camphoratus and Thymus mastichina,
Food Chem., 2004, 86, 2, 183-188, https://doi.org/10.1016/j.foodchem.2003.08.031
. [all data]
Mockutë, Bernotienë, et al., 2004
Mockutë, D.; Bernotienë, G.; Judbentienë, A.,
Chemical composition of essential oils of Origanum vulgare L. growing in Lithuania,
Biologija, 2004, 4, 44-49. [all data]
Mockutë, Judbentienë, et al., 2004
Mockutë, D.; Judbentienë, A.; Bernotienë, G.,
Volatile constituents of cultivated Origanum vulgare L. inflorescences and leaves,
Chemija, 2004, 15, 1, 33-37. [all data]
Sahin, Gulluce, et al., 2004
Sahin, F.; Gulluce, M.; Daferera, D.; Sokmen, A.; Sokmen, M.; Polissiou, M.; Agar, G.; Ozer, H.,
Biological activities of the essential oils and methanol extract of Origanum vulgare ssp. vulgare in the Eastern Anatolia region of Turkey,
Food Control, 2004, 15, 7, 549-557, https://doi.org/10.1016/j.foodcont.2003.08.009
. [all data]
Singh, Marimuthu, et al., 2004
Singh, G.; Marimuthu, P.; Catalan, C.; deLampasona, M.P.,
Chemical, antioxidant and antifungal activities of volatile oil of black pepper and its acetone extract,
J. Sci. Food Agric., 2004, 84, 14, 1878-1884, https://doi.org/10.1002/jsfa.1863
. [all data]
Singh, Maurya, et al., 2004
Singh, G.; Maurya, S.; Catalan, C.; de Lampasona, M.P.,
Chemical constituents, antifungal and antioxidative effects of ajwain essential oil and Its acetone extract,
J. Agric. Food Chem., 2004, 52, 11, 3292-3296, https://doi.org/10.1021/jf035211c
. [all data]
Tepe, Donmez, et al., 2004
Tepe, B.; Donmez, E.; Unlu, M.; Candan, F.; Daferera, D.; Vardar-Unlu, G.; Polissiou, M.; Sokmen, A.,
Antimicrobial and antioxidative activities of the essential oils and methanol extracts of Salvia cryptantha (Montbret et Aucher ex Benth.) and Salvia multicaulis (Vahl),
Food Chem., 2004, 84, 4, 519-525, https://doi.org/10.1016/S0308-8146(03)00267-X
. [all data]
Touafek, Nacer, et al., 2004
Touafek, O.; Nacer, A.; Kabouce, A.; Kabouche, Z.; Bruneau, C.,
Chemical composition of the essential oil of Rosmarinus officinalis cultivated in the Algerian sahara,
Chem. Nat. Compd. (Engl. Transl.), 2004, 40, 1, 28-29, https://doi.org/10.1023/B:CONC.0000025460.78222.69
. [all data]
Vinogradov, 2004
Vinogradov, B.A.,
Production, composition, properties and application of essential oils, 2004, retrieved from http://viness.narod.ru. [all data]
Mockute, Bernotiene, et al., 2003
Mockute, D.; Bernotiene, G.; Judzentiene, A.,
The β-ocimene chemotype of essential oils of the inflorescences and the leaves with stems from Origanum vulgare ssp. vulgare growing wild in Lithuania,
Biochem. Syst. Ecol., 2003, 31, 3, 269-278, https://doi.org/10.1016/S0305-1978(02)00151-5
. [all data]
Mockute and Judzentiene, 2003
Mockute, D.; Judzentiene, A.,
The myrtenol chemotype of essential oil of Tanacetum vulgare L. var. vulgare (tansy) growing wild in the Vilnius region,
Chemija, 2003, 14, 2, 103-107. [all data]
Usai, Atzei, et al., 2003
Usai, M.; Atzei, A.; Pintore, G.; Casanova, I.,
Composition and variability of the essential oil of Sardinian Thymus herba-barona Loisel,
Flavour Fragr. J., 2003, 18, 1, 21-25, https://doi.org/10.1002/ffj.1137
. [all data]
Kilic, 2002
Kilic, A.,
Volatile compounds of buds, flowers and fruits of bay (Laurus nobilis L.) and their odour contribution,
Proc. ICNP-2002 - Trabzon/Turkiye, 2002, 338-341. [all data]
Nogueira and Romano, 2002
Nogueira, J.M.F.; Romano, A.,
Essential oils from micropropagated plants of Lavandula viridis,
Phytochem. Anal., 2002, 13, 1, 4-7, https://doi.org/10.1002/pca.609
. [all data]
Aparicio, Romero, et al., 2001
Aparicio, R.; Romero, M.; Rojas, L.B.; Khouri, N.; Usubillaga, A.,
Composition of the essential oil of four species of Ruilopezia from the Venezuelan Andes,
Flavour Fragr. J., 2001, 16, 3, 172-174, https://doi.org/10.1002/ffj.973
. [all data]
Figueiredo, Miguel, et al., 2001
Figueiredo, A.C.; Miguel, M.G.; Duarte, A.M.F.; Barroso, J.G.; Pedro, L.G.,
Essential oil composition of Thymus lotocephallus G. López R. Morales, collected during flowering and vegetative phases,
Flavour Fragr. J., 2001, 16, 6, 417-421, https://doi.org/10.1002/ffj.1028
. [all data]
Dorman, Figueiredo, et al., 2000
Dorman, H.J.D.; Figueiredo, A.C.; Barroso, J.G.; Deans, S.G.,
In vitro evaluation of antioxidant activity of essential oils and their components,
Flavour Fragr. J., 2000, 15, 1, 12-16, https://doi.org/10.1002/(SICI)1099-1026(200001/02)15:1<12::AID-FFJ858>3.0.CO;2-V
. [all data]
Kéita, Vincent, et al., 2000
Kéita, S.M.; Vincent, C.; Schmit, J.-P.; Bélanger, A.,
Essential oil composition of Ocimum basilicum L., O. gratissimum L. and O. suave L. in the Republic of Guinea,
Flavour Fragr. J., 2000, 15, 5, 339-341, https://doi.org/10.1002/1099-1026(200009/10)15:5<339::AID-FFJ922>3.0.CO;2-H
. [all data]
Weyerstahl, Marschall, et al., 1999, 2
Weyerstahl, P.; Marschall, H.; Splittgerber, U.; Son, P.T.; Giang, P.M.; Kaul, V.K.,
Constituents of the essential oil from the fruits of Zanthoxylum rhetsoides Drake from Vietnam and from the aerial parts of Zanthoxylum alatum Roxb. from India,
Flavour Fragr. J., 1999, 14, 4, 225-229, https://doi.org/10.1002/(SICI)1099-1026(199907/08)14:4<225::AID-FFJ818>3.0.CO;2-1
. [all data]
Baratta, Dorman, et al., 1998
Baratta, M.T.; Dorman, H.J.; Deans, S.G.; Figueiredo, A.C.; Barroso, J.G.; Ruberto, G.,
Antimicrobial and antioxidant properties of some commercial essential oils,
Flavour Fragr. J., 1998, 13, 4, 235-244, https://doi.org/10.1002/(SICI)1099-1026(1998070)13:4<235::AID-FFJ733>3.0.CO;2-T
. [all data]
Sanda, Koba, et al., 1998
Sanda, K.; Koba, K.; Nambo, P.; Gaset, A.,
Chemical investigation of Ocimum species growing in Togo,
Flavour Fragr. J., 1998, 13, 4, 226-232, https://doi.org/10.1002/(SICI)1099-1026(1998070)13:4<226::AID-FFJ717>3.0.CO;2-H
. [all data]
Yusuf, Begum, et al., 1998
Yusuf, M.; Begum, J.; Mondello, L.; Stagno d'Alcontres, I.S.,
Studies on the essential oil bearing plants of Bangladesh. Part VI. Composition of the oil of Ocimum gratissimum L.,
Flavour Fragr. J., 1998, 13, 3, 163-166, https://doi.org/10.1002/(SICI)1099-1026(199805/06)13:3<163::AID-FFJ714>3.0.CO;2-1
. [all data]
Weyerstahl, Marschall, et al., 1997
Weyerstahl, P.; Marschall, H.; Seelmann, I.; Rustaiyan, A.,
Constituents of the essential oil of Achillea eriophora DC,
Flavour Fragr. J., 1997, 12, 2, 71-78, https://doi.org/10.1002/(SICI)1099-1026(199703)12:2<71::AID-FFJ620>3.0.CO;2-E
. [all data]
Zenkevich, 1997
Zenkevich, I.G.,
Analytical Parameters of Components of Essential Oils for their Chromatographic and Chromato-Spectral Identificaiton. Oxsigenated derivatives of Mono- and Sesquiterpene Hydrocarbons,
Rastit, Resursy (Rus.), 1997, 33, 1, 16-28. [all data]
Sagrero-Nieves and Bartley, 1995
Sagrero-Nieves, L.; Bartley, J.P.,
Volatile Constituents from the Leaves of Chenopodium ambrosioides L.,
J. Essent. Oil Res., 1995, 7, 2, 221-223, https://doi.org/10.1080/10412905.1995.9698506
. [all data]
De Pooter and Schamp, 1987
De Pooter, H.L.; Schamp, N.M.,
The Essential Oil of Mentha X villosa nm. alopecuroides,
Flavour Fragr. J., 1987, 2, 4, 163-165, https://doi.org/10.1002/ffj.2730020405
. [all data]
Lee, Umano, et al., 2005
Lee, S.-J.; Umano, K.; Shibamoto, T.; Lee, K.-G.,
Identification of volatile components in basil (Ocimum basilicum L.) and thyme leaves (Thymus vulgaris L.) and their antioxidant properties,
Food Chem., 2005, 91, 1, 131-137, https://doi.org/10.1016/j.foodchem.2004.05.056
. [all data]
Qian and Wang, 2005
Qian, M.C.; Wang, Y.,
Seasonal Variations of Volatile Composition and Odor Activity Value of Marion (Rubus spp. hyb) and Thornless Evergreen (R.laciniatus L.) Blackberries,
J. Food. Sci., 2005, 70, 1, c13-c20, https://doi.org/10.1111/j.1365-2621.2005.tb09013.x
. [all data]
Choi, 2004
Choi, H.-S.,
Aroma evaluation of an aquatic herb, changpo (Acorus calamus Var. angustatus Bess), by AEDA and SPME,
J. Agric. Food Chem., 2004, 52, 26, 8099-8104, https://doi.org/10.1021/jf040239p
. [all data]
Suleimenov, Atazharova, et al., 2003
Suleimenov, E.M.; Atazharova, G.A.; Demirchi, B.; Baser, K.H.C.; Adekenov, S.M.,
Essential oil composition of Artemisia Lercheana and A. Sieversiana of Kazakhstan flora
in Recent problems of development of new medicines of natural origin, Proceedings of symposium, St.Petersburg - Pushkin, 2003, 382-385. [all data]
Tu, Onishi, et al., 2003
Tu, N.T.M.; Onishi, Y.; Son, U.S.; Ogawa, E.; Ukeda, H.; Sawamura, M.,
Characteristic odour components of Citrus inflata Hort. Ex Tanaka (Mochiyu) cold-pressed peel oil,
Flavour Fragr. J., 2003, 18, 5, 454-459, https://doi.org/10.1002/ffj.1252
. [all data]
Umano, Hagi, et al., 2002
Umano, K.; Hagi, Y.; Shibamoto, T.,
Volatile chemicals identified in extracts from newly hybrid citrus, dekopon (Shiranuhi mandarin Suppl. J.),
J. Agric. Food Chem., 2002, 50, 19, 5355-5359, https://doi.org/10.1021/jf0203951
. [all data]
Korány, Mednyánszky, et al., 2000
Korány, K.; Mednyánszky, Zs.; Amtmann, M.,
Preliminary results of a recognition method visualizing the aroma and fragrance features,
Acta Aliment., 2000, 29, 2, 187-198, https://doi.org/10.1556/AAlim.29.2000.2.9
. [all data]
Umano, Hagi, et al., 2000
Umano, K.; Hagi, Y.; Nakahara, K.; Shoji, A.; Shibamoto, T.,
Volatile chemicals identified in extracts from leaves of Japanese mugwort (Artemisia princeps Pamp.),
J. Agric. Food Chem., 2000, 48, 8, 3463-3469, https://doi.org/10.1021/jf0001738
. [all data]
Ngassoum, Yonkeu, et al., 1999
Ngassoum, M.B.; Yonkeu, S.; Jirovetz, L.; Buchbauer, G.; Schmaus, G.; Hammerschmidt, F.-J.H.,
Chemical composition of essential oils of Lantana camara leaves and flowers from Cameroon and Madagascar,
Flavour Fragr. J., 1999, 14, 4, 245-250, https://doi.org/10.1002/(SICI)1099-1026(199907/08)14:4<245::AID-FFJ819>3.0.CO;2-X
. [all data]
Bignell, Dunlop, et al., 1998
Bignell, C.M.; Dunlop, P.J.; Brophy, J.J.,
Volatile leaf oils of some South-Western and Southern Australian species of the genus Eucalyptus (Series 1). Part XIX,
Flavour Fragr. J., 1998, 13, 2, 131-139, https://doi.org/10.1002/(SICI)1099-1026(199803/04)13:2<131::AID-FFJ710>3.0.CO;2-X
. [all data]
Tümen, Baser, et al., 1998
Tümen, G.; Baser, K.H.C.; Demirci, B.; Ermin, N.,
The essential oils of Satureja coerulea Janka and Thymus aznavourii Velen.,
Flavour Fragr. J., 1998, 13, 1, 65-67, https://doi.org/10.1002/(SICI)1099-1026(199801/02)13:1<65::AID-FFJ695>3.0.CO;2-Q
. [all data]
Baser, Kirimer, et al., 1997
Baser, K.H.C.; Kirimer, N.; Duman, H.,
Composition of the essential oil of Micromeria dolichodontha P. H. Davis,
Flavour Fragr. J., 1997, 12, 4, 289-291, https://doi.org/10.1002/(SICI)1099-1026(199707)12:4<289::AID-FFJ640>3.0.CO;2-A
. [all data]
Kaya, Benirci, et al., 2007
Kaya, A.; Benirci, B.; Baser, K.H.C.,
Micromorphology of glandular trichomes of Nepeta congesta Fisch. Mey. var. congesta (LAmiaceae) and chemical analysis of the essential oils,
South African J. Botany, 2007, 73, 1, 29-34, https://doi.org/10.1016/j.sajb.2006.05.004
. [all data]
Tabanca, Demirci, et al., 2007
Tabanca, N.; Demirci, F.; Demirci, B.; Wedge, D.E.; Baser, K.H.C.,
Composition, enantiomeric distribution, and antimicrobial activity of Tanacetum argenteum subsp. ?abellifolium essential oil,
J. Pharm. Biomed. Anal., 2007, 45, 5, 714-719, https://doi.org/10.1016/j.jpba.2007.08.006
. [all data]
Tabanca N., Demirci B., et al., 2007
Tabanca N.; Demirci B.; Crockett S.L.; Baser K.H.C.; Wedge D.E.,
Chemical composition and antifungal activity of Arnica longifolia, Aster hesperius, and Chrysothamnus nauseosus essential oils,
J. Agric. Food Chem., 2007, 55, 21, 8430-8435, https://doi.org/10.1021/jf071379c
. [all data]
Demirci B., Baser K.H.C., et al., 2006
Demirci B.; Baser K.H.C.; Tabanca N.; Wedge D.E.,
Characterization of volatile constituents of Haplopappus greenei and studies on the antifungal activity against phytopathogens,
J. Agric. Food Chem., 2006, 54, 8, 3146-3150, https://doi.org/10.1021/jf053222v
. [all data]
Iscan, Kirimer, et al., 2006
Iscan, G.; Kirimer, N.; Kurkcuoglu, M.; Arabaci, T.; Kupeli, E.; Baser, K.H.C.,
Biological Activity and Composition of the Essential Oils of Achillea schischkinii Sosn. and Achillea aleppica DC. subsp. aleppica,
J. Agric. Food Chem., 2006, 54, 1, 170-173, https://doi.org/10.1021/jf051644z
. [all data]
Kürkçüoglu, Hüsnü Can Baser, et al., 2006
Kürkçüoglu, M.; Hüsnü Can Baser, K.; Iscan, G.; Malyer, H.; Kaynak, G.,
Composition and anticandidal activity of the essential oil of Chaerophyllum byzantinum Boiss.,
Flavour Fragr. J., 2006, 21, 1, 115-117, https://doi.org/10.1002/ffj.1539
. [all data]
Suleimenov Y.M., Atazhanova G.A., et al., 2006
Suleimenov Y.M.; Atazhanova G.A.; Ozek T.; Demirci B.; Kulyyasov A.T.; Adekenov S.M.; Baser K.H.C.,
Essential oil composition of three species of Achillea from Kazakhstan,
Chem. Nat. Compd. (Engl. Transl.), 2006, 37, 5, 447-450, https://doi.org/10.1023/A:1014471326724
. [all data]
Tabanca, Demirci, et al., 2006
Tabanca, N.; Demirci, B.; Can Baser, K.H.; Aytac, Z.; Ekici, M.; Khan, S.I.; Jacob, M.R.; Wedge, D.E.,
Chemical Composition and Antifungal Activity of Salvia macrochlamys and Salvia recognita Essential Oils,
J. Agric. Food Chem., 2006, 54, 18, 6593-6597, https://doi.org/10.1021/jf0608773
. [all data]
Demirci, Demirci, et al., 2005
Demirci, B.; Demirci, F.; Dönmez, A.A.; Franz, G.; Paper, D.H.; Baser, K.H.C.,
Effects of Salvia essential oils on the chorioallantoic membrane (CAM) assay,
Pharm. Biol., 2005, 43, 8, 666-671, https://doi.org/10.1080/13880200500383397
. [all data]
Kosar, Özek, et al., 2005
Kosar, M.; Özek, T.; Göger, F.; Kürkcüoglu, M.; Hüsnü Can Baser, K.,
Comparison of Microwave-Assisted Hydrodistillation and Hydrodistillation Methods for the Analysis of Volatile Secondary Metabolites,
Pharm. Biol., 2005, 43, 6, 491-495, https://doi.org/10.1080/13880200500220136
. [all data]
Tabanca, Demirci, et al., 2005
Tabanca, N.; Demirci, B.; Kirimer, N.; Baser, K.H.C.; Bedir, E.; Khand, I.A.; Wedge, D.E.,
Gas chromatographic-mass spectrometric analysis of essential oils from Pimpinella aurea, Pimpinella corymbosa, Pimpinella peregrina and Pimpinella puberula gathered from Eastern and Southern Turkey,
J. Chromatogr. A, 2005, 1097, 1-2, 192-198, https://doi.org/10.1016/j.chroma.2005.10.047
. [all data]
Demirci, Paper, et al., 2004
Demirci, F.; Paper, D.H.; Franz, G.; Hüsnü Can Baser, K.,
Investigation of the origanum onites L. essential oil using the Chorioallantoic Membrane (CAM) assay,
J. Agric. Food Chem., 2004, 52, 2, 251-254, https://doi.org/10.1021/jf034850k
. [all data]
Baser, Demirci, et al., 2003
Baser, K.H.C.; Demirci, B.; Dekebo, A.; Dagne, E.,
Essential oils of some Boswellia spp., myrrh and opopanax,
Flavour Fragr. J., 2003, 18, 2, 153-156, https://doi.org/10.1002/ffj.1166
. [all data]
Demirci, Baser, et al., 2003
Demirci, B.; Baser, K.H.C.; Yildiz, B.; Bahcecioglu, Z.,
Composition of the essential oils of six endemic Salvia spp. from Turkey,
Flavour Fragr. J., 2003, 18, 2, 116-121, https://doi.org/10.1002/ffj.1173
. [all data]
Kaya, Demirci, et al., 2003
Kaya, A.; Demirci, B.; Baser, K.H.C.,
The essential oil of Seseli tortuosum L. growing in Turkey,
Flavour Fragr. J., 2003, 18, 2, 159-161, https://doi.org/10.1002/ffj.1162
. [all data]
Kürkcüoglu, Demirci, et al., 2003
Kürkcüoglu, M.; Demirci, B.; Tabanca, N.; Özek, T.; Baser, K.H.C.,
The essential oil of Achillea falcata L.,
Flavour Fragr. J., 2003, 18, 3, 192-194, https://doi.org/10.1002/ffj.1176
. [all data]
Viljoen, van Vuuren, et al., 2003
Viljoen, A.; van Vuuren, S.; Ernst, E.; Klepser, M.; Demirci, B.; Baser, H.; van Wyk, B.-E.,
Osmitopsis asteriscoides (Asteraceae)-the antimicrobial activity and essential oil composition of a Cape-Dutch remedy,
J. Ethnopharmacol., 2003, 88, 2-3, 137-143, https://doi.org/10.1016/S0378-8741(03)00191-0
. [all data]
Baser, Demirci, et al., 2002
Baser, K.H.C.; Demirci, B.; Kirimer, N.; Satil, F.; Tumen, G.,
The essential oils of Thymus migricus and T. fedtschenkoi var. handelii from Turkey,
Flavour Fragr. J., 2002, 17, 1, 41-45, https://doi.org/10.1002/ffj.1036
. [all data]
Baser, Nuriddinov, et al., 2002
Baser, K.H.C.; Nuriddinov, H.R.; Ozek, T.; Demirci, A.B.; Azcan, N.; Nigmatullaev, A.M.,
Essential oil of Arischrada korolkowii from the Chatkal mountains of Uzbekistan,
Chem. Nat. Compd. (Engl. Transl.), 2002, 38, 1, 51-53, https://doi.org/10.1023/A:1015729731464
. [all data]
Demirci, Baser, et al., 2002
Demirci, B.; Baser, K.H.C.; Tümen, G.,
Composition of the essential oil of Salvia aramiensis Rech. fil. growing in Turkey,
Flavour Fragr. J., 2002, 17, 1, 23-25, https://doi.org/10.1002/ffj.1027
. [all data]
Hüsnü Can Baser, Demirci, et al., 2002
Hüsnü Can Baser, K.; Demirci, B.; Femirci, F.; Kocak, S.; Akinci, C.; Malyer, H.; Güleryüz, G.,
Composition and antimicrobial activity of the essential oil of Achellea multifida,
Planta Medica, 2002, 68, 10, 941-943, https://doi.org/10.1055/s-2002-34923
. [all data]
Tunalier, Kirimer, et al., 2002
Tunalier, Z.; Kirimer, N.; Baser, K.H.C.,
The composition of essential oils from various parts of Juniperus foetidissima,
Chem. Nat. Compd. (Engl. Transl.), 2002, 38, 1, 43-47, https://doi.org/10.1023/A:1015725630556
. [all data]
Baser, Demirci, et al., 2001
Baser, K.H.C.; Demirci, B.; Tabanca, N.; Özek, T.; Gören, N.,
Composition of the essential oils of Tanacetum armenum (DC.) Schultz Bip., T. balsamita L., T. chiliophyllum (Fisch. Mey.) Schultz Bip. var. chiliophyllum and T. haradjani (Rech. fil.) Grierson and the enantiomeric distribution of camphor and carvone,
Flavour Fragr. J., 2001, 16, 3, 195-200, https://doi.org/10.1002/ffj.977
. [all data]
Gören, Demirci, et al., 2001
Gören, N.; Demirci, B.; Baser, K.H.C.,
Composition of the essential oils of Tanacetum spp. from Turkey,
Flavour Fragr. J., 2001, 16, 3, 191-194, https://doi.org/10.1002/ffj.976
. [all data]
Kirimer N., Tabanea N., et al., 2001
Kirimer N.; Tabanea N.; Demirci B.; Baser K.H.C.; Duman H.; Aytac Z.,
The essential oil of a new Sideritis species: Sideritis ozturkii Aytac and Aksoy,
Chem. Nat. Compd. (Engl. Transl.), 2001, 37, 3, 234-237, https://doi.org/10.1023/A:1012561806033
. [all data]
Özcan, Akgül, et al., 2001
Özcan, M.; Akgül, A.; Bascr, K.H.C.; Özck, T.; Tabanca, N.,
Essential oil composition of sea fennel (Crithmum maritimum) form Turkey,
Nahrung/Food, 2001, 45, 5, 353-356, https://doi.org/10.1002/1521-3803(20011001)45:5<353::AID-FOOD353>3.0.CO;2-4
. [all data]
Saglam, Gozler, et al., 2001
Saglam, H.; Gozler, T.; Kivcak, B.; Demirci, B.; Baser, K.H.C.,
Volatile compounds from Haplophyllum myrtifolium,
Chem. Nat. Compd. (Engl. Transl.), 2001, 37, 5, 442-444, https://doi.org/10.1023/A:1014467225815
. [all data]
Tabanca, Kirimer, et al., 2001
Tabanca, N.; Kirimer, N.; Can Baser, K.H.,
The composition of essential oils from two varieties of Sideritis erythrantha var. erythrantha and var. cedretorum,
Turk. J. Chem., 2001, 25, 201-208. [all data]
Tabanca, Kirimer, et al., 2001, 2
Tabanca, N.; Kirimer, N.; Demirci, B.; Demirci, F.; Can Baser, K.H.,
Composition and antimicrobial activity of the essential oils of Micromeria cristata subsp. phrygia and the enantiomeric distribution of borneol,
J. Agric. Food Chem., 2001, 49, 9, 4300-4303, https://doi.org/10.1021/jf0105034
. [all data]
Baser, Tabanca, et al., 2000
Baser, K.H.C.; Tabanca, N.; Özek, T.; Demirci, B.; Duran, A.; Duman, H.,
Composition of the essential oil of Chaerophyllum aksekiense A. Duran et Duman, a recently described endemic from Turkey,
Flavour Fragr. J., 2000, 15, 1, 43-44, https://doi.org/10.1002/(SICI)1099-1026(200001/02)15:1<43::AID-FFJ864>3.0.CO;2-#
. [all data]
Kirimer, Tabanca, et al., 2000
Kirimer, N.; Tabanca, N.; Özek, T.; Tümen, G.; Baser, K.H.C.,
Essential oils of annual Sideritis species growing in Turkey,
Pharm. Biol., 2000, 38, 2, 106-111, https://doi.org/10.1076/1388-0209(200004)3821-1FT106
. [all data]
Kirimer, Tabanca, et al., 1999
Kirimer, N.; Tabanca, N.; Ozek, T.; Basher, K.H.C.; Tumen, G.,
Composition of essential oils from two endemic Sideritis species of Turkey,
Chem. Natural Comp., 1999, 35, 1, 61-64, https://doi.org/10.1007/BF02238211
. [all data]
Baser, Kürkcüoglu, et al., 1998
Baser, K.H.C.; Kürkcüoglu, M.; Aytac, Z.,
Composition of the essential oil of Salvia euphratica Montbret ex Bentham var. euphratica from Turkey,
Flavour Fragr. J., 1998, 13, 1, 63-64, https://doi.org/10.1002/(SICI)1099-1026(199801/02)13:1<63::AID-FFJ694>3.0.CO;2-Z
. [all data]