Methanesulfinic acid
- Formula: CH4O2S
- Molecular weight: 80.106
- IUPAC Standard InChIKey: XNEFVTBPCXGIRX-UHFFFAOYSA-N
- CAS Registry Number: 17696-73-0
- Chemical structure:
View 3d structure (requires JavaScript / HTML 5) - Permanent link for this species. Use this link for bookmarking this species for future reference.

Reaction thermochemistry data

Data compiled by: John E. Bartmess
Individual Reactions
CH3O2S- + =
By formula: CH3O2S- + H+ = CH4O2S
Quantity | Value | Units | Method | Reference | Comment |
---|---|---|---|---|---|
ΔrH° | 1371. ± 22. | kJ/mol | G+TS | Sorensen | gas phase; Between CF2HCO2H and CF3CO2H. |
Quantity | Value | Units | Method | Reference | Comment |
ΔrG° | 1341. ± 22. | kJ/mol | IMRB | Sorensen | gas phase; Between CF2HCO2H and CF3CO2H. |

Gas phase ion energetics data

Data compiled by: John E. Bartmess
De-protonation reactions
CH3O2S- + =
By formula: CH3O2S- + H+ = CH4O2S
Quantity | Value | Units | Method | Reference | Comment |
---|---|---|---|---|---|
ΔrH° | 1371. ± 22. | kJ/mol | G+TS | Sorensen | gas phase; Between CF2HCO2H and CF3CO2H. |
Quantity | Value | Units | Method | Reference | Comment |
ΔrG° | 1341. ± 22. | kJ/mol | IMRB | Sorensen | gas phase; Between CF2HCO2H and CF3CO2H. |

References

Sorensen
Sorensen, D.,
, Thesis, Univ. of Tennessee. [all data]