Acetic acid, chloro-, 1-methylpropyl ester
- Formula: C6H11ClO2
- Molecular weight: 150.603
- IUPAC Standard InChIKey: MCUHSYTVMNEJFT-UHFFFAOYSA-N
- CAS Registry Number: 17696-64-9
- Chemical structure:
View 3d structure (requires JavaScript / HTML 5) - Other names: Chloroacetic acid, 2-butyl ester; Chloroacetic acid, sec-butyl ester

Phase change data

Data compiled as indicated in comments:
AC - William E. Acree, Jr., James S. Chickos
Enthalpy of vaporization
ΔvapH (kJ/mol) | Temperature (K) | Method | Reference | Comment |
---|---|---|---|---|
49.6 | 305. | A | Stephenson and Malanowski, 1987 | Based on data from 290. to 441. K.; AC |
Antoine Equation Parameters
log10(P) = A − (B / (T + C))
P = vapor pressure (bar)
T = temperature (K)
View plot Requires a JavaScript / HTML 5 canvas capable browser.
Temperature (K) | A | B | C | Reference | Comment |
---|---|---|---|---|---|
303. to 444.7 | 4.88518 | 1969.594 | -36.395 | Nelson, 1928 | Coefficents calculated by NIST from author's data. |

Van Den Dool and Kratz RI, non-polar column, temperature ramp

Column type | Active phase | I | Reference | Comment |
---|---|---|---|---|
Capillary | SE-30 | 941. | Korhonen, 1984 | 6. K/min; Column length: 25. m; Column diameter: 0.3 mm; Tstart: 50. C |

Van Den Dool and Kratz RI, polar column, temperature ramp

Column type | Active phase | I | Reference | Comment |
---|---|---|---|---|
Capillary | OV-351 | 1362. | Korhonen, 1984 | 6. K/min; Column length: 25. m; Column diameter: 0.32 mm; Tstart: 50. C |

References

Stephenson and Malanowski, 1987
Stephenson, Richard M.; Malanowski, Stanislaw,
Handbook of the Thermodynamics of Organic Compounds, 1987, https://doi.org/10.1007/978-94-009-3173-2
. [all data]
Nelson, 1928
Nelson, O.A.,
Vapor Pressures of Fumigants: I---Methyl, Ethyl, Isopropyl, and Secondary Butyl Chloroacetates 1,
Ind. Eng. Chem., 1928, 20, 12, 1380-1382, https://doi.org/10.1021/ie50228a034
. [all data]
Korhonen, 1984
Korhonen, I.O.O.,
Gas-Liquid Chromatographic Analyses. XXV. Branched-Chain C3-C5 Alkyl Esters of Halogenated Acetic Acids,
J. Chromatogr., 1984, 288, 51-69, https://doi.org/10.1016/S0021-9673(01)93681-7
. [all data]