N,N-Dimethylcyclopropanecarboxamide
- Formula: C6H11NO
- Molecular weight: 113.1576
- IUPAC Standard InChIKey: DVQLGAFYVKJEDE-UHFFFAOYSA-N
- CAS Registry Number: 17696-23-0
- Chemical structure:
View 3d structure (requires JavaScript / HTML 5) - Permanent link for this species. Use this link for bookmarking this species for future reference.

Phase change data

Data compiled by: Robert L. Brown and Stephen E. Stein
Reduced pressure boiling point
Tboil (K) | Pressure (bar) | Reference |
---|---|---|
378. to 380. | 0.033 | Frinton Laboratories Inc., 1986 |

References

Frinton Laboratories Inc., 1986
Frinton Laboratories Inc.,
Catalog Number 11, Frinton Laboratories Inc., Vineland, NJ, 1986, 99. [all data]