Acetamide, 2-(hydroxyimino)-N-phenyl-

Phase change data

Data compiled as indicated in comments:
AC - William E. Acree, Jr., James S. Chickos
DH - Eugene S. Domalski and Elizabeth D. Hearing

Enthalpy of fusion

ΔfusH (kJ/mol) Temperature (K) Method Reference Comment
10.4453.1DTACuevas, Solans, et al., 1982AC
10.400448.N/ACuevas, Solans, et al., 1982, 2DH

Entropy of fusion

ΔfusS (J/mol*K) Temperature (K) Reference Comment
23.2448.Cuevas, Solans, et al., 1982, 2DH

References

Cuevas, Solans, et al., 1982
Cuevas, M.A.; Solans, X.; Artus, L., Melting temperatures and enthalpies of isonitrosoacetanilide derivatives. Their relation with structure, Afinidad, 1982, 39, 381, 406. [all data]

Cuevas, Solans, et al., 1982, 2
Cuevas, M.A.; Solans, X.; Artus, L., Melting temperatures and enthalpies of isonitrosoacetanilide derivatives. Their relaxation with structure, Afinidad, 1982, 39(381), 406-408. [all data]