di-μ-carbonyldecacarbonyl-triangulo-triiron
- Formula: C12Fe3O12
- Molecular weight: 503.656
- CAS Registry Number: 17685-52-8

Gas phase thermochemistry data

Data compiled by: José A. Martinho Simões
Quantity | Value | Units | Method | Reference | Comment |
---|---|---|---|---|---|
ΔfH°gas | -1746. ± 24. | kJ/mol | Review | Martinho Simões | |
ΔfH°gas | -1756. ± 25. | kJ/mol | Review | Martinho Simões | |
ΔfH°gas | -1751. ± 23. | kJ/mol | Review | Martinho Simões | Selected data. Average of the values from Connor, Skinner, et al., 1973 |

Phase change data

Data compiled as indicated in comments:
AC - William E. Acree, Jr., James S. Chickos
MS - José A. Martinho Simões
Quantity | Value | Units | Method | Reference | Comment |
---|---|---|---|---|---|
ΔsubH° | 96. ± 21. | kJ/mol | N/A | Pilcher and Skinner, 1983 | See also Connor, Skinner, et al., 1972.; AC |
ΔsubH° | 96. ± 21. | kJ/mol | TD-HFC | Connor, Skinner, et al., 1973 | MS |

Reaction thermochemistry data

Data compiled by: José A. Martinho Simões
Individual Reactions
C12Fe3O12 (cr) = 12 (g) + 3
(cr)
By formula: C12Fe3O12 (cr) = 12CO (g) + 3Fe (cr)
Quantity | Value | Units | Method | Reference | Comment |
---|---|---|---|---|---|
ΔrH° | 516. ± 12. | kJ/mol | TD-HFC | Connor, Skinner, et al., 1973 | |
ΔrH° | 526. ± 13. | kJ/mol | HAL-HFC | Connor, Skinner, et al., 1973 |

Condensed phase thermochemistry data

Data compiled by: José A. Martinho Simões
Quantity | Value | Units | Method | Reference | Comment |
---|---|---|---|---|---|
ΔfH°solid | -440.2 ± 2.8 | kcal/mol | Review | Martinho Simões | |
ΔfH°solid | -442.7 ± 3.1 | kcal/mol | Review | Martinho Simões | |
ΔfH°solid | -441.5 ± 2.1 | kcal/mol | Review | Martinho Simões | Selected data. Average of the values from Connor, Skinner, et al., 1973 |

Gas phase ion energetics data

Data compiled as indicated in comments:
LBLHLM - Sharon G. Lias, John E. Bartmess, Joel F. Liebman, John L. Holmes, Rhoda D. Levin, and W. Gary Mallard
LLK - Sharon G. Lias, Rhoda D. Levin, and Sherif A. Kafafi
Ionization energy determinations
IE (eV) | Method | Reference | Comment |
---|---|---|---|
7.44 | PE | DeKock, Wong, et al., 1982 | LBLHLM |
7.8 | PE | Wong, Dutta, et al., 1981 | LLK |

References

Martinho Simões
Martinho Simões, J.A.,
Private communication (see http://webbook.nist.gov/chemistry/om/). [all data]
Connor, Skinner, et al., 1973
Connor, J.A.; Skinner, H.A.; Virmani, Y.,
High temperature microcalorimetric studies of the thermal decomposition and iodination of polynuclear carbonyls of Fe, Co, Ru, Rh, Re, Os and Ir,
Faraday Symp. Chem. Soc., 1973, 8, 18, https://doi.org/10.1039/fs9730800018
. [all data]
Pilcher and Skinner, 1983
Pilcher, G.; Skinner, H.A.,
Thermochemistry of organometallic compounds, 1983, 43-90, https://doi.org/10.1002/9780470771686.ch2
. [all data]
Connor, Skinner, et al., 1972
Connor, J.A.; Skinner, H.A.; Virmani, Y.,
Microcalorimetric studies. Thermal decomposition and iodination of metal carbonyls,
J. Chem. Soc., Faraday Trans. 1, 1972, 68, 0, 1754, https://doi.org/10.1039/f19726801754
. [all data]