1-Hexanol, 4-methyl-, (S)-
- Formula: C7H16O
- Molecular weight: 116.2013
- IUPAC Standard InChIKey: YNPVNLWKVZZBTM-SSDOTTSWSA-N
- CAS Registry Number: 1767-46-0
- Chemical structure:
View 3d structure (requires JavaScript / HTML 5) - Stereoisomers:

Phase change data

Data compiled by: Thermodynamics Research Center, NIST Boulder Laboratories, Chris Muzny director
Quantity | Value | Units | Method | Reference | Comment |
---|---|---|---|---|---|
Tboil | 445.15 | K | N/A | Milburn and Truter, 1954 | Uncertainty assigned by TRC = 2. K |

References

Milburn and Truter, 1954
Milburn, A.H.; Truter, E.V.,
Components of Wool Wax II. Synthesis of the Acids and Alcohols of the Iso- and the (+)-Anteiso-Series,
J. Chem. Soc., 1954, 1954, 3344. [all data]