Urea, 3-(hydroxymethyl)-1,1-dimethyl-
- Formula: C4H10N2O2
- Molecular weight: 118.1344
- IUPAC Standard InChIKey: GNIMYRNRLPAMNV-UHFFFAOYSA-N
- CAS Registry Number: 17660-99-0
- Chemical structure:
View 3d structure (requires JavaScript / HTML 5) - Permanent link for this species. Use this link for bookmarking this species for future reference.

Reaction thermochemistry data

Data compiled by: Hussein Y. Afeefy, Joel F. Liebman, and Stephen E. Stein
Individual Reactions
By formula: CH2O + C3H8N2O = C4H10N2O2
Quantity | Value | Units | Method | Reference | Comment |
---|---|---|---|---|---|
ΔrH° | -20. ± 0.8 | kJ/mol | Kin | Perepelkova, Igranova, et al., 1981 | liquid phase; solvent: Phosphate buffer |

References

Perepelkova, Igranova, et al., 1981
Perepelkova, T.I.; Igranova, E.G.; Moiseev, V.D.; Demchenko, L.Ya.; Zhuravleva, I.I.,
Calorimetric study of the methylolation of 1,1-dimethylurea,
Khim. Promst. Ser. Proizvod. Pererab. Plastmass Sint. Smol, 1981, 15-18. [all data]