monodesethyl-flurazepam
- Formula: C19H19ClFN3O
- Molecular weight: 359.825
- IUPAC Standard InChIKey: DINCAJAWFDEDPU-UHFFFAOYSA-N
- CAS Registry Number: 17656-74-5
- Chemical structure:
View 3d structure (requires JavaScript / HTML 5) - Permanent link for this species. Use this link for bookmarking this species for future reference.

Kovats' RI, non-polar column, isothermal

Column type | Active phase | Temperature (C) | I | Reference | Comment |
---|---|---|---|---|---|
Packed | SE-30 | 250. | 2970. | Schütz, 1982 | N2 |

References

Schütz, 1982
Schütz, H.,
Benzodiazepines, Springer-Verlag, New York, 1982, 438. [all data]